null
SMILES: COc1cc(ccc1Nc1ncc2N(C)C(=O)c3ccccc3N(C)c2n1)N1CCN(C)CC1
InChI Key: InChIKey=DDTPGANIPBKTNU-UHFFFAOYSA-N
PDB links: 1 PDB ID matches this monomer.
Activity Spreadsheet -- Enzyme Inhibition Constant Data from BindingDB
Found 12 hits for monomerid = 50337127
Trg + Lig
Ki
nM
ΔG°
kcal/mole
IC50
nM
Kd
nM
EC50/IC50
nM
koff
s-1
kon
M-1s-1
pHTemp
°C
Mitogen-activated protein kinase 7
(Homo sapiens (Human))
BDBM50337127
(2-(2-methoxy-4-(4-methylpiperazin-1-yl)phenylamino...)
Show SMILES COc1cc(ccc1Nc1ncc2N(C)C(=O)c3ccccc3N(C)c2n1)N1CCN(C)CC1
Show InChI InChI=1S/C25H29N7O2/c1-29-11-13-32(14-12-29)17-9-10-19(22(15-17)34-4)27-25-26-16-21-23(28-25)30(2)20-8-6-5-7-18(20)24(33)31(21)3/h5-10,15-16H,11-14H2,1-4H3,(H,26,27,28)
US Patent
n/an/an/a 19n/an/an/an/an/a
Dana-Farber Cancer Institute, Inc.
US Patent
Assay Description
In vitro Erk5 binding assay: Ambit Kd values in nanomolar. Kd values generated by Ambit binding assay over a concentration range of the compound.
US Patent US9266890 (2016)
BindingDB Entry DOI: 10.7270/Q27M06RB
Serine/threonine-protein kinase DCLK1
(Homo sapiens (Human))
BDBM50337127
(2-(2-methoxy-4-(4-methylpiperazin-1-yl)phenylamino...)
Show SMILES COc1cc(ccc1Nc1ncc2N(C)C(=O)c3ccccc3N(C)c2n1)N1CCN(C)CC1
Show InChI InChI=1S/C25H29N7O2/c1-29-11-13-32(14-12-29)17-9-10-19(22(15-17)34-4)27-25-26-16-21-23(28-25)30(2)20-8-6-5-7-18(20)24(33)31(21)3/h5-10,15-16H,11-14H2,1-4H3,(H,26,27,28)
n/an/an/a 1.20n/an/an/an/an/a
TBA
Curated by ChEMBL
Assay Description
Binding affinity to DCAMKL1 by immobilized ligand displacement assay
ACS Med Chem Lett 2: 195-200 (2011)
Article DOI: 10.1021/ml100304b
BindingDB Entry DOI: 10.7270/Q2222VSB
3D
3D Structure (crystal)
Serine/threonine-protein kinase DCLK2
(Homo sapiens (Human))
BDBM50337127
(2-(2-methoxy-4-(4-methylpiperazin-1-yl)phenylamino...)
Show SMILES COc1cc(ccc1Nc1ncc2N(C)C(=O)c3ccccc3N(C)c2n1)N1CCN(C)CC1
Show InChI InChI=1S/C25H29N7O2/c1-29-11-13-32(14-12-29)17-9-10-19(22(15-17)34-4)27-25-26-16-21-23(28-25)30(2)20-8-6-5-7-18(20)24(33)31(21)3/h5-10,15-16H,11-14H2,1-4H3,(H,26,27,28)
n/an/an/a 10n/an/an/an/an/a
TBA
Curated by ChEMBL
Assay Description
Binding affinity to DCAMKL2 by immobilized ligand displacement assay
ACS Med Chem Lett 2: 195-200 (2011)
Article DOI: 10.1021/ml100304b
BindingDB Entry DOI: 10.7270/Q2222VSB
Cyclin-G-associated kinase
(Homo sapiens (Human))
BDBM50337127
(2-(2-methoxy-4-(4-methylpiperazin-1-yl)phenylamino...)
Show SMILES COc1cc(ccc1Nc1ncc2N(C)C(=O)c3ccccc3N(C)c2n1)N1CCN(C)CC1
Show InChI InChI=1S/C25H29N7O2/c1-29-11-13-32(14-12-29)17-9-10-19(22(15-17)34-4)27-25-26-16-21-23(28-25)30(2)20-8-6-5-7-18(20)24(33)31(21)3/h5-10,15-16H,11-14H2,1-4H3,(H,26,27,28)
Reactome pathway
n/an/an/a 450n/an/an/an/an/a
TBA
Curated by ChEMBL
Assay Description
Binding affinity to GAK by immobilized ligand displacement assay
ACS Med Chem Lett 2: 195-200 (2011)
Article DOI: 10.1021/ml100304b
BindingDB Entry DOI: 10.7270/Q2222VSB
Non-receptor tyrosine-protein kinase TNK1
(Homo sapiens (Human))
BDBM50337127
(2-(2-methoxy-4-(4-methylpiperazin-1-yl)phenylamino...)
Show SMILES COc1cc(ccc1Nc1ncc2N(C)C(=O)c3ccccc3N(C)c2n1)N1CCN(C)CC1
Show InChI InChI=1S/C25H29N7O2/c1-29-11-13-32(14-12-29)17-9-10-19(22(15-17)34-4)27-25-26-16-21-23(28-25)30(2)20-8-6-5-7-18(20)24(33)31(21)3/h5-10,15-16H,11-14H2,1-4H3,(H,26,27,28)
n/an/an/a 29n/an/an/an/an/a
TBA
Curated by ChEMBL
Assay Description
Binding affinity to TNK1 by immobilized ligand displacement assay
ACS Med Chem Lett 2: 195-200 (2011)
Article DOI: 10.1021/ml100304b
BindingDB Entry DOI: 10.7270/Q2222VSB
Bromodomain-containing protein 4
(Homo sapiens (Human))
BDBM50337127
(2-(2-methoxy-4-(4-methylpiperazin-1-yl)phenylamino...)
Show SMILES COc1cc(ccc1Nc1ncc2N(C)C(=O)c3ccccc3N(C)c2n1)N1CCN(C)CC1
Show InChI InChI=1S/C25H29N7O2/c1-29-11-13-32(14-12-29)17-9-10-19(22(15-17)34-4)27-25-26-16-21-23(28-25)30(2)20-8-6-5-7-18(20)24(33)31(21)3/h5-10,15-16H,11-14H2,1-4H3,(H,26,27,28)
n/an/a 888n/an/an/an/an/an/a
Harvard Medical School
Curated by ChEMBL
Assay Description
Inhibition of BRD4 bromodomain 1 (unknown origin) by AlphaScreen displacement assay
J Med Chem 63: 7817-7826 (2020)
Article DOI: 10.1021/acs.jmedchem.0c00596
BindingDB Entry DOI: 10.7270/Q2SB4981
Mitogen-activated protein kinase 7
(Homo sapiens (Human))
BDBM50337127
(2-(2-methoxy-4-(4-methylpiperazin-1-yl)phenylamino...)
Show SMILES COc1cc(ccc1Nc1ncc2N(C)C(=O)c3ccccc3N(C)c2n1)N1CCN(C)CC1
Show InChI InChI=1S/C25H29N7O2/c1-29-11-13-32(14-12-29)17-9-10-19(22(15-17)34-4)27-25-26-16-21-23(28-25)30(2)20-8-6-5-7-18(20)24(33)31(21)3/h5-10,15-16H,11-14H2,1-4H3,(H,26,27,28)
n/an/a 190n/an/an/an/an/an/a
TBA
Curated by ChEMBL
Assay Description
Inhibition of EGF-induced BMK1 autophosphorylation in human HeLa cells by SDS-PAGE analysis
ACS Med Chem Lett 2: 195-200 (2011)
Article DOI: 10.1021/ml100304b
BindingDB Entry DOI: 10.7270/Q2222VSB
Serine/threonine-protein kinase DCLK1
(Homo sapiens (Human))
BDBM50337127
(2-(2-methoxy-4-(4-methylpiperazin-1-yl)phenylamino...)
Show SMILES COc1cc(ccc1Nc1ncc2N(C)C(=O)c3ccccc3N(C)c2n1)N1CCN(C)CC1
Show InChI InChI=1S/C25H29N7O2/c1-29-11-13-32(14-12-29)17-9-10-19(22(15-17)34-4)27-25-26-16-21-23(28-25)30(2)20-8-6-5-7-18(20)24(33)31(21)3/h5-10,15-16H,11-14H2,1-4H3,(H,26,27,28)
n/an/a 11n/an/an/an/an/an/a
Harvard Medical School
Curated by ChEMBL
Assay Description
Inhibition of recombinant human N-terminal His6-tagged DCLK1 (G351 to H689 residues) expressed in Escherichia coli BL21 DE3 using 5-FAM-KKLRRTLSVA-CO...
J Med Chem 63: 7817-7826 (2020)
Article DOI: 10.1021/acs.jmedchem.0c00596
BindingDB Entry DOI: 10.7270/Q2SB4981
3D
3D Structure (crystal)
Leucine-rich repeat serine/threonine-protein kinase 2
(Homo sapiens (Human))
BDBM50337127
(2-(2-methoxy-4-(4-methylpiperazin-1-yl)phenylamino...)
Show SMILES COc1cc(ccc1Nc1ncc2N(C)C(=O)c3ccccc3N(C)c2n1)N1CCN(C)CC1
Show InChI InChI=1S/C25H29N7O2/c1-29-11-13-32(14-12-29)17-9-10-19(22(15-17)34-4)27-25-26-16-21-23(28-25)30(2)20-8-6-5-7-18(20)24(33)31(21)3/h5-10,15-16H,11-14H2,1-4H3,(H,26,27,28)
n/an/a 29n/an/an/an/an/an/a
Harvard Medical School
Curated by ChEMBL
Assay Description
Inhibition of recombinant human GST-tagged LRRK2 catalytic domain (970 to 2527 residues) expressed in baculovirus expression system using LRRKtide as...
J Med Chem 63: 7817-7826 (2020)
Article DOI: 10.1021/acs.jmedchem.0c00596
BindingDB Entry DOI: 10.7270/Q2SB4981
Activated CDC42 kinase 1
(Homo sapiens (Human))
BDBM50337127
(2-(2-methoxy-4-(4-methylpiperazin-1-yl)phenylamino...)
Show SMILES COc1cc(ccc1Nc1ncc2N(C)C(=O)c3ccccc3N(C)c2n1)N1CCN(C)CC1
Show InChI InChI=1S/C25H29N7O2/c1-29-11-13-32(14-12-29)17-9-10-19(22(15-17)34-4)27-25-26-16-21-23(28-25)30(2)20-8-6-5-7-18(20)24(33)31(21)3/h5-10,15-16H,11-14H2,1-4H3,(H,26,27,28)
n/an/a 959n/an/an/an/an/an/a
Harvard Medical School
Curated by ChEMBL
Assay Description
Inhibition of tracer 236 binding to recombinant human GST-tagged TNK2 catalytic domain (110 to 476 residues) expressed in baculovirus expression syst...
Bioorg Med Chem Lett 30: (2020)
Article DOI: 10.1016/j.bmcl.2020.126948
BindingDB Entry DOI: 10.7270/Q28G8Q7S
Mitogen-activated protein kinase 7
(Homo sapiens (Human))
BDBM50337127
(2-(2-methoxy-4-(4-methylpiperazin-1-yl)phenylamino...)
Show SMILES COc1cc(ccc1Nc1ncc2N(C)C(=O)c3ccccc3N(C)c2n1)N1CCN(C)CC1
Show InChI InChI=1S/C25H29N7O2/c1-29-11-13-32(14-12-29)17-9-10-19(22(15-17)34-4)27-25-26-16-21-23(28-25)30(2)20-8-6-5-7-18(20)24(33)31(21)3/h5-10,15-16H,11-14H2,1-4H3,(H,26,27,28)
n/an/a 87n/an/an/an/an/an/a
Harvard Medical School
Curated by ChEMBL
Assay Description
Inhibition of ERK5 in human HeLa cells assessed as reduction in EGF-induced ERK5 autophosphorylation pretreated for 1 hr followed by EGF stimulation ...
J Med Chem 63: 7817-7826 (2020)
Article DOI: 10.1021/acs.jmedchem.0c00596
BindingDB Entry DOI: 10.7270/Q2SB4981
Activated CDC42 kinase 1
(Homo sapiens (Human))
BDBM50337127
(2-(2-methoxy-4-(4-methylpiperazin-1-yl)phenylamino...)
Show SMILES COc1cc(ccc1Nc1ncc2N(C)C(=O)c3ccccc3N(C)c2n1)N1CCN(C)CC1
Show InChI InChI=1S/C25H29N7O2/c1-29-11-13-32(14-12-29)17-9-10-19(22(15-17)34-4)27-25-26-16-21-23(28-25)30(2)20-8-6-5-7-18(20)24(33)31(21)3/h5-10,15-16H,11-14H2,1-4H3,(H,26,27,28)
n/an/an/a 440n/an/an/an/an/a
TBA
Curated by ChEMBL
Assay Description
Binding affinity to TNK2 by immobilized ligand displacement assay
ACS Med Chem Lett 2: 195-200 (2011)
Article DOI: 10.1021/ml100304b
BindingDB Entry DOI: 10.7270/Q2222VSB