BDBM50337138 4-((5,11-dimethyl-6-oxo-6,11-dihydro-5H-benzo[e]pyrimido[5,4-b][1,4]diazepin-2-yl)amino)-N-(2-(dimethylamino)ethyl)-3-methoxybenzamide::CHEMBL1673050
SMILES: COc1cc(ccc1Nc1ncc2N(C)C(=O)c3ccccc3N(C)c2n1)C(=O)NCCN(C)C
InChI Key: InChIKey=GIYVCQVJJYRKEE-UHFFFAOYSA-N
Data: 1 IC50
Activity Spreadsheet -- Enzyme Inhibition Constant Data from BindingDB
Found 1 hit for monomerid = 50337138
Trg + Lig
Ki
nM
ΔG°
kcal/mole
IC50
nM
Kd
nM
EC50/IC50
nM
koff
s-1
kon
M-1s-1
pHTemp
°C
Extracellular signal-regulated kinase 5 (ERK5)
(Homo sapiens (Human))
BDBM50337138
(4-((5,11-dimethyl-6-oxo-6,11-dihydro-5H-benzo[e]py...)
Show SMILES COc1cc(ccc1Nc1ncc2N(C)C(=O)c3ccccc3N(C)c2n1)C(=O)NCCN(C)C
Show InChI InChI=1S/C25H29N7O3/c1-30(2)13-12-26-23(33)16-10-11-18(21(14-16)35-5)28-25-27-15-20-22(29-25)31(3)19-9-7-6-8-17(19)24(34)32(20)4/h6-11,14-15H,12-13H2,1-5H3,(H,26,33)(H,27,28,29)
n/an/a 240n/an/an/an/an/an/a
TBA
Curated by ChEMBL
Assay Description
Inhibition of EGF-induced BMK1 autophosphorylation in human HeLa cells by SDS-PAGE analysis
ACS Med Chem Lett 2: 195-200 (2011)
Article DOI: 10.1021/ml100304b
BindingDB Entry DOI: 10.7270/Q2222VSB