BDBM50337266 3-(2-chlorobenzyloxy)-2-(4-chlorophenyl)-2,6,7,8,9,10-hexahydrocyclohepta[b]pyrazolo[3,4-d]pyridine::CHEMBL1681890
SMILES: Clc1ccc(cc1)-n1nc2c3CCCCCc3ncc2c1OCc1ccccc1Cl
InChI Key: InChIKey=ARBXYFIBGCCVTN-UHFFFAOYSA-N
Data: 2 IC50
Activity Spreadsheet -- Enzyme Inhibition Constant Data from BindingDB
Found 2 hits for monomerid = 50337266
Trg + Lig
Ki
nM
ΔG°
kcal/mole
IC50
nM
Kd
nM
EC50/IC50
nM
koff
s-1
kon
M-1s-1
pHTemp
°C
Gamma-aminobutyric acid receptor subunit alpha-1
(Homo sapiens (Human))
BDBM50337266
(3-(2-chlorobenzyloxy)-2-(4-chlorophenyl)-2,6,7,8,9...)
Show SMILES Clc1ccc(cc1)-n1nc2c3CCCCCc3ncc2c1OCc1ccccc1Cl
Show InChI InChI=1S/C24H21Cl2N3O/c25-17-10-12-18(13-11-17)29-24(30-15-16-6-4-5-8-21(16)26)20-14-27-22-9-3-1-2-7-19(22)23(20)28-29/h4-6,8,10-14H,1-3,7,9,15H2
Reactome pathway
n/an/a 242n/an/an/an/an/an/a
Novartis Institutes for BioMedical Research
Curated by ChEMBL
Assay Description
Displacement of [3H]flumazenil from GABAA receptor subunit alpha-1 expressed in CHO cells
Bioorg Med Chem Lett 21: 1523-6 (2011)
Article DOI: 10.1016/j.bmcl.2010.12.107
BindingDB Entry DOI: 10.7270/Q289164V
Gamma-aminobutyric acid receptor subunit alpha-2
(Homo sapiens (Human))
BDBM50337266
(3-(2-chlorobenzyloxy)-2-(4-chlorophenyl)-2,6,7,8,9...)
Show SMILES Clc1ccc(cc1)-n1nc2c3CCCCCc3ncc2c1OCc1ccccc1Cl
Show InChI InChI=1S/C24H21Cl2N3O/c25-17-10-12-18(13-11-17)29-24(30-15-16-6-4-5-8-21(16)26)20-14-27-22-9-3-1-2-7-19(22)23(20)28-29/h4-6,8,10-14H,1-3,7,9,15H2
n/an/a 605n/an/an/an/an/an/a
Novartis Institutes for BioMedical Research
Curated by ChEMBL
Assay Description
Displacement of [3H]flumazenil from GABAA receptor subunit alpha-2 expressed in CHO cells
Bioorg Med Chem Lett 21: 1523-6 (2011)
Article DOI: 10.1016/j.bmcl.2010.12.107
BindingDB Entry DOI: 10.7270/Q289164V