BDBM50337277 2-(4-chlorophenyl)-3-(cyclopropylmethoxy)-8-(1H-imidazol-1-yl)-2H-pyrazolo[4,3-c]quinoline::CHEMBL1681899
SMILES: Clc1ccc(cc1)-n1nc2c(cnc3ccc(cc23)-n2ccnc2)c1OCC1CC1
InChI Key: InChIKey=DOAWPHZLUZJQQM-UHFFFAOYSA-N
Data: 2 IC50
Activity Spreadsheet -- Enzyme Inhibition Constant Data from BindingDB
Found 2 hits for monomerid = 50337277
Trg + Lig
Ki
nM
ΔG°
kcal/mole
IC50
nM
Kd
nM
EC50/IC50
nM
koff
s-1
kon
M-1s-1
pHTemp
°C
Gamma-aminobutyric acid receptor subunit alpha-2
(Homo sapiens (Human))
BDBM50337277
(2-(4-chlorophenyl)-3-(cyclopropylmethoxy)-8-(1H-im...)
Show SMILES Clc1ccc(cc1)-n1nc2c(cnc3ccc(cc23)-n2ccnc2)c1OCC1CC1
Show InChI InChI=1S/C23H18ClN5O/c24-16-3-5-17(6-4-16)29-23(30-13-15-1-2-15)20-12-26-21-8-7-18(28-10-9-25-14-28)11-19(21)22(20)27-29/h3-12,14-15H,1-2,13H2
n/an/a 2.11E+3n/an/an/an/an/an/a
Novartis Institutes for BioMedical Research
Curated by ChEMBL
Assay Description
Displacement of [3H]flumazenil from GABAA receptor subunit alpha-2 expressed in CHO cells
Bioorg Med Chem Lett 21: 1523-6 (2011)
Article DOI: 10.1016/j.bmcl.2010.12.107
BindingDB Entry DOI: 10.7270/Q289164V
Gamma-aminobutyric acid receptor subunit alpha-1
(Homo sapiens (Human))
BDBM50337277
(2-(4-chlorophenyl)-3-(cyclopropylmethoxy)-8-(1H-im...)
Show SMILES Clc1ccc(cc1)-n1nc2c(cnc3ccc(cc23)-n2ccnc2)c1OCC1CC1
Show InChI InChI=1S/C23H18ClN5O/c24-16-3-5-17(6-4-16)29-23(30-13-15-1-2-15)20-12-26-21-8-7-18(28-10-9-25-14-28)11-19(21)22(20)27-29/h3-12,14-15H,1-2,13H2
Reactome pathway
n/an/a 134n/an/an/an/an/an/a
Novartis Institutes for BioMedical Research
Curated by ChEMBL
Assay Description
Displacement of [3H]flumazenil from GABAA receptor subunit alpha-1 expressed in CHO cells
Bioorg Med Chem Lett 21: 1523-6 (2011)
Article DOI: 10.1016/j.bmcl.2010.12.107
BindingDB Entry DOI: 10.7270/Q289164V