BDBM50337595 3-(4-(4-(3-phenylpropoxy)phenyl)-5,6-dihydropyridin-1(2H)-yl)propanoic acid::CHEMBL1683049
SMILES: OC(=O)CCN1CCC(=CC1)c1ccc(OCCCc2ccccc2)cc1
InChI Key: InChIKey=MDNBHQVSBWFJLJ-UHFFFAOYSA-N
Data: 2 EC50
Activity Spreadsheet -- Enzyme Inhibition Constant Data from BindingDB
Found 2 hits for monomerid = 50337595
Trg + Lig
Ki
nM
ΔG°
kcal/mole
IC50
nM
Kd
nM
EC50/IC50
nM
koff
s-1
kon
M-1s-1
pHTemp
°C
Sphingosine 1-phosphate receptor 3
(Homo sapiens (Human))
BDBM50337595
(3-(4-(4-(3-phenylpropoxy)phenyl)-5,6-dihydropyridi...)
Show SMILES OC(=O)CCN1CCC(=CC1)c1ccc(OCCCc2ccccc2)cc1 |c:8|
Show InChI InChI=1S/C23H27NO3/c25-23(26)14-17-24-15-12-21(13-16-24)20-8-10-22(11-9-20)27-18-4-7-19-5-2-1-3-6-19/h1-3,5-6,8-12H,4,7,13-18H2,(H,25,26)
NCI pathway
Reactome pathway
n/an/an/an/a 1.20E+3n/an/an/an/a
Ono Pharmaceutical Co., Ltd
Curated by ChEMBL
Assay Description
Agonist activity at human S1P3 receptor expressed in CHO cells assessed as intracellular calcium levels
Bioorg Med Chem Lett 21: 1390-3 (2011)
Article DOI: 10.1016/j.bmcl.2011.01.029
BindingDB Entry DOI: 10.7270/Q26973VP
Sphingosine 1-phosphate receptor 1
(Homo sapiens (Human))
BDBM50337595
(3-(4-(4-(3-phenylpropoxy)phenyl)-5,6-dihydropyridi...)
Show SMILES OC(=O)CCN1CCC(=CC1)c1ccc(OCCCc2ccccc2)cc1 |c:8|
Show InChI InChI=1S/C23H27NO3/c25-23(26)14-17-24-15-12-21(13-16-24)20-8-10-22(11-9-20)27-18-4-7-19-5-2-1-3-6-19/h1-3,5-6,8-12H,4,7,13-18H2,(H,25,26)
Reactome pathway
n/an/an/an/a 45n/an/an/an/a
Ono Pharmaceutical Co., Ltd
Curated by ChEMBL
Assay Description
Agonist activity at human S1P1 receptor expressed in CHO cells assessed as intracellular calcium levels
Bioorg Med Chem Lett 21: 1390-3 (2011)
Article DOI: 10.1016/j.bmcl.2011.01.029
BindingDB Entry DOI: 10.7270/Q26973VP