BDBM50337650 3-isopropyl-1-(3-methoxybenzyl)-1-(3-(phenylethynyl)benzyl)urea::CHEMBL1683207
SMILES: COc1cccc(CN(Cc2cccc(c2)C#Cc2ccccc2)C(=O)NC(C)C)c1
InChI Key: InChIKey=WCGLXHAPTRXOBU-UHFFFAOYSA-N
Data: 2 IC50
Activity Spreadsheet -- Enzyme Inhibition Constant Data from BindingDB
Found 2 hits for monomerid = 50337650
Trg + Lig
Ki
nM
ΔG°
kcal/mole
IC50
nM
Kd
nM
EC50/IC50
nM
koff
s-1
kon
M-1s-1
pHTemp
°C
Prostaglandin E synthase
(Homo sapiens (Human))
BDBM50337650
(3-isopropyl-1-(3-methoxybenzyl)-1-(3-(phenylethyny...)
Show SMILES COc1cccc(CN(Cc2cccc(c2)C#Cc2ccccc2)C(=O)NC(C)C)c1
Show InChI InChI=1S/C27H28N2O2/c1-21(2)28-27(30)29(20-25-13-8-14-26(18-25)31-3)19-24-12-7-11-23(17-24)16-15-22-9-5-4-6-10-22/h4-14,17-18,21H,19-20H2,1-3H3,(H,28,30)
Reactome pathway
n/an/a 46n/an/an/an/an/an/a
Merck Frosst Center for Therapeutic Research
Curated by ChEMBL
Assay Description
Inhibition of mPGES1
Bioorg Med Chem Lett 21: 1488-92 (2011)
Article DOI: 10.1016/j.bmcl.2011.01.006
BindingDB Entry DOI: 10.7270/Q2XS5VNP
Prostaglandin E synthase
(Homo sapiens (Human))
BDBM50337650
(3-isopropyl-1-(3-methoxybenzyl)-1-(3-(phenylethyny...)
Show SMILES COc1cccc(CN(Cc2cccc(c2)C#Cc2ccccc2)C(=O)NC(C)C)c1
Show InChI InChI=1S/C27H28N2O2/c1-21(2)28-27(30)29(20-25-13-8-14-26(18-25)31-3)19-24-12-7-11-23(17-24)16-15-22-9-5-4-6-10-22/h4-14,17-18,21H,19-20H2,1-3H3,(H,28,30)
Reactome pathway
n/an/a 3.60E+3n/an/an/an/an/an/a
Merck Frosst Center for Therapeutic Research
Curated by ChEMBL
Assay Description
Inhibition of mPGES1 in IL-1beta treated human A549 cell microsome assessed as inhibition of PGE2 production after 1 min in presence of 50% FBS
Bioorg Med Chem Lett 21: 1488-92 (2011)
Article DOI: 10.1016/j.bmcl.2011.01.006
BindingDB Entry DOI: 10.7270/Q2XS5VNP