null
SMILES: CC(C)(C)c1cccc2[C@@H](CCOc12)NC(=O)Nc1cccc2[nH]ncc12
InChI Key: InChIKey=FGVFFUSBPJFGCF-QGZVFWFLSA-N
Activity Spreadsheet -- Enzyme Inhibition Constant Data from BindingDB
Found 1 hit for monomerid = 50338002
Trg + Lig
Ki
nM
ΔG°
kcal/mole
IC50
nM
Kd
nM
EC50/IC50
nM
koff
s-1
kon
M-1s-1
pHTemp
°C
Transient receptor potential cation channel subfamily V member 1
(Homo sapiens (Human))
BDBM50338002
((R)-1-(8-tert-butylchroman-4-yl)-3-(1H-indazol-4-y...)
Show SMILES CC(C)(C)c1cccc2[C@@H](CCOc12)NC(=O)Nc1cccc2[nH]ncc12 |r|
Show InChI InChI=1S/C21H24N4O2/c1-21(2,3)15-7-4-6-13-17(10-11-27-19(13)15)24-20(26)23-16-8-5-9-18-14(16)12-22-25-18/h4-9,12,17H,10-11H2,1-3H3,(H,22,25)(H2,23,24,26)/t17-/m1/s1
Reactome pathway
n/an/a 3n/an/an/an/an/an/a
Abbott Laboratories
Curated by ChEMBL
Assay Description
Antagonist activity at human TRPV1 assessed as inhibition of calcium influx
Bioorg Med Chem Lett 21: 1338-41 (2011)
Article DOI: 10.1016/j.bmcl.2011.01.056
BindingDB Entry DOI: 10.7270/Q20K28W6