BDBM50338212 1-(4-(6-amino-5-((methoxyimino)methyl)pyrimidin-4-yloxy)-2-chlorophenyl)-3-(pyridin-4-yl)urea::CHEMBL1681942
SMILES: CO\N=C\c1c(N)ncnc1Oc1ccc(NC(=O)Nc2ccncc2)c(Cl)c1
InChI Key: InChIKey=FUCCZEKBLJWUIX-PGGKNCGUSA-N
Data: 1 IC50
Activity Spreadsheet -- Enzyme Inhibition Constant Data from BindingDB
Found 1 hit for monomerid = 50338212
Trg + Lig
Ki
nM
ΔG°
kcal/mole
IC50
nM
Kd
nM
EC50/IC50
nM
koff
s-1
kon
M-1s-1
pHTemp
°C
Vascular endothelial growth factor receptor 2
(Homo sapiens (Human))
BDBM50338212
(1-(4-(6-amino-5-((methoxyimino)methyl)pyrimidin-4-...)
Show SMILES CO\N=C\c1c(N)ncnc1Oc1ccc(NC(=O)Nc2ccncc2)c(Cl)c1
Show InChI InChI=1S/C18H16ClN7O3/c1-28-24-9-13-16(20)22-10-23-17(13)29-12-2-3-15(14(19)8-12)26-18(27)25-11-4-6-21-7-5-11/h2-10H,1H3,(H2,20,22,23)(H2,21,25,26,27)/b24-9+
NCI pathway
Reactome pathway
n/an/a 11n/an/an/an/an/an/a
Johnson& Johnson Pharmaceutical Research& Development LLC
Curated by ChEMBL
Assay Description
Inhibition of VEGFR2
Bioorg Med Chem Lett 21: 1815-8 (2011)
Article DOI: 10.1016/j.bmcl.2011.01.053
BindingDB Entry DOI: 10.7270/Q2ZP46DK