BDBM50338217 1-(4-(6-amino-5-((methoxyimino)methyl)pyrimidin-4-yloxy)-2-chlorophenyl)-3-(2-chlorophenyl)urea::CHEMBL1681947
SMILES: CO\N=C\c1c(N)ncnc1Oc1ccc(NC(=O)Nc2ccccc2Cl)c(Cl)c1
InChI Key: InChIKey=YXWHDDNTJWPCQM-YCPBAFNGSA-N
Data: 1 IC50
Activity Spreadsheet -- Enzyme Inhibition Constant Data from BindingDB
Found 1 hit for monomerid = 50338217
Trg + Lig
Ki
nM
ΔG°
kcal/mole
IC50
nM
Kd
nM
EC50/IC50
nM
koff
s-1
kon
M-1s-1
pHTemp
°C
Vascular endothelial growth factor receptor 2
(Homo sapiens (Human))
BDBM50338217
(1-(4-(6-amino-5-((methoxyimino)methyl)pyrimidin-4-...)
Show SMILES CO\N=C\c1c(N)ncnc1Oc1ccc(NC(=O)Nc2ccccc2Cl)c(Cl)c1
Show InChI InChI=1S/C19H16Cl2N6O3/c1-29-25-9-12-17(22)23-10-24-18(12)30-11-6-7-16(14(21)8-11)27-19(28)26-15-5-3-2-4-13(15)20/h2-10H,1H3,(H2,22,23,24)(H2,26,27,28)/b25-9+
NCI pathway
Reactome pathway
n/an/a 2.60n/an/an/an/an/an/a
Johnson& Johnson Pharmaceutical Research& Development LLC
Curated by ChEMBL
Assay Description
Inhibition of VEGFR2
Bioorg Med Chem Lett 21: 1815-8 (2011)
Article DOI: 10.1016/j.bmcl.2011.01.053
BindingDB Entry DOI: 10.7270/Q2ZP46DK