BDBM50338223 1-(4-(6-amino-5-((methoxyimino)methyl)pyrimidin-4-yloxy)-2-chlorophenyl)-3-(2,4-difluorophenyl)urea::CHEMBL1681953
SMILES: CO\N=C\c1c(N)ncnc1Oc1ccc(NC(=O)Nc2ccc(F)cc2F)c(Cl)c1
InChI Key: InChIKey=MJSONEGTUDGRDH-MWRNPHMMSA-N
Data: 1 IC50
Activity Spreadsheet -- Enzyme Inhibition Constant Data from BindingDB
Found 1 hit for monomerid = 50338223
Trg + Lig
Ki
nM
ΔG°
kcal/mole
IC50
nM
Kd
nM
EC50/IC50
nM
koff
s-1
kon
M-1s-1
pHTemp
°C
Vascular endothelial growth factor receptor 2
(Homo sapiens (Human))
BDBM50338223
(1-(4-(6-amino-5-((methoxyimino)methyl)pyrimidin-4-...)
Show SMILES CO\N=C\c1c(N)ncnc1Oc1ccc(NC(=O)Nc2ccc(F)cc2F)c(Cl)c1
Show InChI InChI=1S/C19H15ClF2N6O3/c1-30-26-8-12-17(23)24-9-25-18(12)31-11-3-5-15(13(20)7-11)27-19(29)28-16-4-2-10(21)6-14(16)22/h2-9H,1H3,(H2,23,24,25)(H2,27,28,29)/b26-8+
NCI pathway
Reactome pathway
n/an/a 3n/an/an/an/an/an/a
Johnson& Johnson Pharmaceutical Research& Development LLC
Curated by ChEMBL
Assay Description
Inhibition of VEGFR2
Bioorg Med Chem Lett 21: 1815-8 (2011)
Article DOI: 10.1016/j.bmcl.2011.01.053
BindingDB Entry DOI: 10.7270/Q2ZP46DK