BDBM50338225 1-(4-(6-amino-5-((methoxyimino)methyl)pyrimidin-4-yloxy)-2-chlorophenyl)-3-cyclohexylurea::CHEMBL1681955
SMILES: CO\N=C\c1c(N)ncnc1Oc1ccc(NC(=O)NC2CCCCC2)c(Cl)c1
InChI Key: InChIKey=PRZHKENLVLLMJL-YSURURNPSA-N
Data: 1 IC50
Activity Spreadsheet -- Enzyme Inhibition Constant Data from BindingDB
Found 1 hit for monomerid = 50338225
Trg + Lig
Ki
nM
ΔG°
kcal/mole
IC50
nM
Kd
nM
EC50/IC50
nM
koff
s-1
kon
M-1s-1
pHTemp
°C
Vascular endothelial growth factor receptor 2
(Homo sapiens (Human))
BDBM50338225
(1-(4-(6-amino-5-((methoxyimino)methyl)pyrimidin-4-...)
Show SMILES CO\N=C\c1c(N)ncnc1Oc1ccc(NC(=O)NC2CCCCC2)c(Cl)c1
Show InChI InChI=1S/C19H23ClN6O3/c1-28-24-10-14-17(21)22-11-23-18(14)29-13-7-8-16(15(20)9-13)26-19(27)25-12-5-3-2-4-6-12/h7-12H,2-6H2,1H3,(H2,21,22,23)(H2,25,26,27)/b24-10+
NCI pathway
Reactome pathway
n/an/a 6.5n/an/an/an/an/an/a
Johnson& Johnson Pharmaceutical Research& Development LLC
Curated by ChEMBL
Assay Description
Inhibition of VEGFR2
Bioorg Med Chem Lett 21: 1815-8 (2011)
Article DOI: 10.1016/j.bmcl.2011.01.053
BindingDB Entry DOI: 10.7270/Q2ZP46DK