null
SMILES: CCOC(=O)c1c(NC(=O)Cc2ccc(OC)cc2)scc1C1CC1
InChI Key: InChIKey=JMFUODYQAAMVIK-UHFFFAOYSA-N
Activity Spreadsheet -- Enzyme Inhibition Constant Data from BindingDB
Found 3 hits for monomerid = 50338270
Trg + Lig
Ki
nM
ΔG°
kcal/mole
IC50
nM
Kd
nM
EC50/IC50
nM
koff
s-1
kon
M-1s-1
pHTemp
°C
Mitogen-activated protein kinase 9
(Homo sapiens (Human))
BDBM50338270
(CHEMBL1681994 | ethyl 4-cyclopropyl-2-(2-(4-methox...)
Show SMILES CCOC(=O)c1c(NC(=O)Cc2ccc(OC)cc2)scc1C1CC1
Show InChI InChI=1S/C19H21NO4S/c1-3-24-19(22)17-15(13-6-7-13)11-25-18(17)20-16(21)10-12-4-8-14(23-2)9-5-12/h4-5,8-9,11,13H,3,6-7,10H2,1-2H3,(H,20,21)
NCI pathway
Reactome pathway
n/an/a 6.29E+3n/an/an/an/an/an/a
Elan Pharmaceuticals, Inc.
Curated by ChEMBL
Assay Description
Inhibition of recombinant JNK2 after 60 mins by TR-FRET assay
Bioorg Med Chem Lett 21: 1838-43 (2011)
Article DOI: 10.1016/j.bmcl.2011.01.046
BindingDB Entry DOI: 10.7270/Q2Q52PX0
Mitogen-activated protein kinase 10
(Homo sapiens (Human))
BDBM50338270
(CHEMBL1681994 | ethyl 4-cyclopropyl-2-(2-(4-methox...)
Show SMILES CCOC(=O)c1c(NC(=O)Cc2ccc(OC)cc2)scc1C1CC1
Show InChI InChI=1S/C19H21NO4S/c1-3-24-19(22)17-15(13-6-7-13)11-25-18(17)20-16(21)10-12-4-8-14(23-2)9-5-12/h4-5,8-9,11,13H,3,6-7,10H2,1-2H3,(H,20,21)
NCI pathway
Reactome pathway
n/an/a 9.62E+3n/an/an/an/an/an/a
Elan Pharmaceuticals, Inc.
Curated by ChEMBL
Assay Description
Inhibition of recombinant JNK3 after 60 mins by TR-FRET assay
Bioorg Med Chem Lett 21: 1838-43 (2011)
Article DOI: 10.1016/j.bmcl.2011.01.046
BindingDB Entry DOI: 10.7270/Q2Q52PX0
Mitogen-activated protein kinase 8
(Homo sapiens (Human))
BDBM50338270
(CHEMBL1681994 | ethyl 4-cyclopropyl-2-(2-(4-methox...)
Show SMILES CCOC(=O)c1c(NC(=O)Cc2ccc(OC)cc2)scc1C1CC1
Show InChI InChI=1S/C19H21NO4S/c1-3-24-19(22)17-15(13-6-7-13)11-25-18(17)20-16(21)10-12-4-8-14(23-2)9-5-12/h4-5,8-9,11,13H,3,6-7,10H2,1-2H3,(H,20,21)
NCI pathway
Reactome pathway
n/an/a 1.56E+4n/an/an/an/an/an/a
Elan Pharmaceuticals, Inc.
Curated by ChEMBL
Assay Description
Inhibition of recombinant JNK1 after 60 mins by TR-FRET assay
Bioorg Med Chem Lett 21: 1838-43 (2011)
Article DOI: 10.1016/j.bmcl.2011.01.046
BindingDB Entry DOI: 10.7270/Q2Q52PX0