BDBM50338358 CHEMBL1682896::rac-6-[1-Hydroxy-1-(1H-imidazol-4-yl)-2-methylpropyl]-Nisopropyl-2-naphthamide
SMILES: CC(C)NC(=O)c1ccc2cc(ccc2c1)C(O)(C(C)C)c1cnc[nH]1
InChI Key: InChIKey=XVSPNIQMNAPNKK-UHFFFAOYSA-N
Data: 3 IC50
Activity Spreadsheet -- Enzyme Inhibition Constant Data from BindingDB
Found 3 hits for monomerid = 50338358
Trg + Lig
Ki
nM
ΔG°
kcal/mole
IC50
nM
Kd
nM
EC50/IC50
nM
koff
s-1
kon
M-1s-1
pHTemp
°C
Cytochrome P450 17A1
(Rattus norvegicus (Rat))
BDBM50338358
(CHEMBL1682896 | rac-6-[1-Hydroxy-1-(1H-imidazol-4-...)
Show SMILES CC(C)NC(=O)c1ccc2cc(ccc2c1)C(O)(C(C)C)c1cnc[nH]1
Show InChI InChI=1S/C21H25N3O2/c1-13(2)21(26,19-11-22-12-23-19)18-8-7-15-9-17(6-5-16(15)10-18)20(25)24-14(3)4/h5-14,26H,1-4H3,(H,22,23)(H,24,25)
n/an/a 12n/an/an/an/an/an/a
Takeda Pharmaceutical Company, Ltd
Curated by ChEMBL
Assay Description
Inhibition of 17,20 lyase activity in Sprague-Dawley rat testicular microsomes
Bioorg Med Chem 19: 1751-70 (2011)
Article DOI: 10.1016/j.bmc.2011.01.017
BindingDB Entry DOI: 10.7270/Q2X92C9F
Cytochrome P450 3A4
(Homo sapiens (Human))
BDBM50338358
(CHEMBL1682896 | rac-6-[1-Hydroxy-1-(1H-imidazol-4-...)
Show SMILES CC(C)NC(=O)c1ccc2cc(ccc2c1)C(O)(C(C)C)c1cnc[nH]1
Show InChI InChI=1S/C21H25N3O2/c1-13(2)21(26,19-11-22-12-23-19)18-8-7-15-9-17(6-5-16(15)10-18)20(25)24-14(3)4/h5-14,26H,1-4H3,(H,22,23)(H,24,25)
Reactome pathway
n/an/a 9.30E+3n/an/an/an/an/an/a
Takeda Pharmaceutical Company, Ltd
Curated by ChEMBL
Assay Description
Inhibition of human CYP3A4
Bioorg Med Chem 19: 1751-70 (2011)
Article DOI: 10.1016/j.bmc.2011.01.017
BindingDB Entry DOI: 10.7270/Q2X92C9F
Cytochrome P450 17A1
(Homo sapiens (Human))
BDBM50338358
(CHEMBL1682896 | rac-6-[1-Hydroxy-1-(1H-imidazol-4-...)
Show SMILES CC(C)NC(=O)c1ccc2cc(ccc2c1)C(O)(C(C)C)c1cnc[nH]1
Show InChI InChI=1S/C21H25N3O2/c1-13(2)21(26,19-11-22-12-23-19)18-8-7-15-9-17(6-5-16(15)10-18)20(25)24-14(3)4/h5-14,26H,1-4H3,(H,22,23)(H,24,25)
Reactome pathway
n/an/a 75n/an/an/an/an/an/a
Takeda Pharmaceutical Company, Ltd
Curated by ChEMBL
Assay Description
Inhibition of 17,20 lyase activity in human
Bioorg Med Chem 19: 1751-70 (2011)
Article DOI: 10.1016/j.bmc.2011.01.017
BindingDB Entry DOI: 10.7270/Q2X92C9F