BDBM50338507 (3R,4S)-1-(6-(6,7-dihydroisoxazolo[4,3-c]pyridin-5(4H)-yl)pyrimidin-4-yl)-4-phenylpyrrolidin-3-amine::CHEMBL1683560
SMILES: N[C@H]1CN(C[C@@H]1c1ccccc1)c1cc(ncn1)N1CCc2nocc2C1
InChI Key: InChIKey=NHALEDNWDATFQS-SJORKVTESA-N
Data: 1 IC50
Activity Spreadsheet -- Enzyme Inhibition Constant Data from BindingDB
Found 1 hit for monomerid = 50338507
Trg + Lig
Ki
nM
ΔG°
kcal/mole
IC50
nM
Kd
nM
EC50/IC50
nM
koff
s-1
kon
M-1s-1
pHTemp
°C
Dipeptidyl peptidase 4
(Homo sapiens (Human))
BDBM50338507
((3R,4S)-1-(6-(6,7-dihydroisoxazolo[4,3-c]pyridin-5...)
Show SMILES N[C@H]1CN(C[C@@H]1c1ccccc1)c1cc(ncn1)N1CCc2nocc2C1 |r|
Show InChI InChI=1S/C20H22N6O/c21-17-11-26(10-16(17)14-4-2-1-3-5-14)20-8-19(22-13-23-20)25-7-6-18-15(9-25)12-27-24-18/h1-5,8,12-13,16-17H,6-7,9-11,21H2/t16-,17+/m1/s1
Reactome pathway
n/an/a 1.60n/an/an/an/an/an/a
Pfizer Inc.
Curated by ChEMBL
Assay Description
Inhibition of human DPP4
Bioorg Med Chem Lett 21: 1810-4 (2011)
Article DOI: 10.1016/j.bmcl.2011.01.055
BindingDB Entry DOI: 10.7270/Q28W3DM7