BDBM50338517 1-((3S,4S)-4-amino-1-(6-(3,3-difluoropyrrolidin-1-yl)pyrimidin-4-yl)pyrrolidin-3-yl)-5,5-difluoropiperidin-2-one::CHEMBL1683570
SMILES: N[C@H]1CN(C[C@@H]1N1CC(F)(F)CCC1=O)c1cc(ncn1)N1CCC(F)(F)C1
InChI Key: InChIKey=RERVIROBQHWDJL-RYUDHWBXSA-N
Data: 2 IC50
Activity Spreadsheet -- Enzyme Inhibition Constant Data from BindingDB
Found 2 hits for monomerid = 50338517
Trg + Lig
Ki
nM
ΔG°
kcal/mole
IC50
nM
Kd
nM
EC50/IC50
nM
koff
s-1
kon
M-1s-1
pHTemp
°C
Dipeptidyl peptidase VIII
(Homo sapiens (Human))
BDBM50338517
(1-((3S,4S)-4-amino-1-(6-(3,3-difluoropyrrolidin-1-...)
Show SMILES N[C@H]1CN(C[C@@H]1N1CC(F)(F)CCC1=O)c1cc(ncn1)N1CCC(F)(F)C1 |r|
Show InChI InChI=1S/C17H22F4N6O/c18-16(19)2-1-15(28)27(9-16)12-7-26(6-11(12)22)14-5-13(23-10-24-14)25-4-3-17(20,21)8-25/h5,10-12H,1-4,6-9,22H2/t11-,12-/m0/s1
n/an/a>3.00E+4n/an/an/an/an/an/a
Pfizer Inc.
Curated by ChEMBL
Assay Description
Inhibition of DPP8
Bioorg Med Chem Lett 21: 1810-4 (2011)
Article DOI: 10.1016/j.bmcl.2011.01.055
BindingDB Entry DOI: 10.7270/Q28W3DM7
Dipeptidyl peptidase 4
(Homo sapiens (Human))
BDBM50338517
(1-((3S,4S)-4-amino-1-(6-(3,3-difluoropyrrolidin-1-...)
Show SMILES N[C@H]1CN(C[C@@H]1N1CC(F)(F)CCC1=O)c1cc(ncn1)N1CCC(F)(F)C1 |r|
Show InChI InChI=1S/C17H22F4N6O/c18-16(19)2-1-15(28)27(9-16)12-7-26(6-11(12)22)14-5-13(23-10-24-14)25-4-3-17(20,21)8-25/h5,10-12H,1-4,6-9,22H2/t11-,12-/m0/s1
Reactome pathway
n/an/a 8.40n/an/an/an/an/an/a
Pfizer Inc.
Curated by ChEMBL
Assay Description
Inhibition of human DPP4
Bioorg Med Chem Lett 21: 1810-4 (2011)
Article DOI: 10.1016/j.bmcl.2011.01.055
BindingDB Entry DOI: 10.7270/Q28W3DM7