BDBM50338676 1,4-Dideoxy-1,4-{(R)-[(2S,3R,4R,5S)-2,3,4,5,6-pentahydroxyhexyl]episulfoniumylidene}-D-arabinitol chloride::CHEMBL1684166
SMILES: OC[C@H](O)[C@@H](O)[C@@H](O)[C@H](O)C[S@@+]1C[C@@H](O)[C@H](O)[C@H]1CO
InChI Key: InChIKey=CDSNPCIXSRDFFK-GGDRNBAWSA-N
Data: 3 IC50
Activity Spreadsheet -- Enzyme Inhibition Constant Data from BindingDB
Found 3 hits for monomerid = 50338676
Trg + Lig
Ki
nM
ΔG°
kcal/mole
IC50
nM
Kd
nM
EC50/IC50
nM
koff
s-1
kon
M-1s-1
pHTemp
°C
alpha-Glucosidase (α-Glucosidase)
(Rattus norvegicus (Rat))
BDBM50338676
(1,4-Dideoxy-1,4-{(R)-[(2S,3R,4R,5S)-2,3,4,5,6-pent...)
Show SMILES OC[C@H](O)[C@@H](O)[C@@H](O)[C@H](O)C[S@@+]1C[C@@H](O)[C@H](O)[C@H]1CO |r|
Show InChI InChI=1S/C11H23O8S/c12-1-5(14)10(18)11(19)7(16)4-20-3-6(15)9(17)8(20)2-13/h5-19H,1-4H2/q+1/t5-,6+,7+,8+,9-,10+,11-,20-/m0/s1
n/an/a 300n/an/an/an/an/an/a
Kinki University
Curated by ChEMBL
Assay Description
Inhibition of rat intestinal sucrase
Bioorg Med Chem 19: 2015-22 (2011)
Article DOI: 10.1016/j.bmc.2011.01.052
BindingDB Entry DOI: 10.7270/Q2J1044C
Acidic alpha-glucosidase
(Rattus norvegicus)
BDBM50338676
(1,4-Dideoxy-1,4-{(R)-[(2S,3R,4R,5S)-2,3,4,5,6-pent...)
Show SMILES OC[C@H](O)[C@@H](O)[C@@H](O)[C@H](O)C[S@@+]1C[C@@H](O)[C@H](O)[C@H]1CO |r|
Show InChI InChI=1S/C11H23O8S/c12-1-5(14)10(18)11(19)7(16)4-20-3-6(15)9(17)8(20)2-13/h5-19H,1-4H2/q+1/t5-,6+,7+,8+,9-,10+,11-,20-/m0/s1
n/an/a 1.30E+3n/an/an/an/an/an/a
Kinki University
Curated by ChEMBL
Assay Description
Inhibition of rat intestinal maltase
Bioorg Med Chem 19: 2015-22 (2011)
Article DOI: 10.1016/j.bmc.2011.01.052
BindingDB Entry DOI: 10.7270/Q2J1044C
alpha-Glucosidase (α-Glucosidase)
(Rattus norvegicus (Rat))
BDBM50338676
(1,4-Dideoxy-1,4-{(R)-[(2S,3R,4R,5S)-2,3,4,5,6-pent...)
Show SMILES OC[C@H](O)[C@@H](O)[C@@H](O)[C@H](O)C[S@@+]1C[C@@H](O)[C@H](O)[C@H]1CO |r|
Show InChI InChI=1S/C11H23O8S/c12-1-5(14)10(18)11(19)7(16)4-20-3-6(15)9(17)8(20)2-13/h5-19H,1-4H2/q+1/t5-,6+,7+,8+,9-,10+,11-,20-/m0/s1
n/an/a 1.00E+3n/an/an/an/an/an/a
Kinki University
Curated by ChEMBL
Assay Description
Inhibition of rat intestinal isomaltase
Bioorg Med Chem 19: 2015-22 (2011)
Article DOI: 10.1016/j.bmc.2011.01.052
BindingDB Entry DOI: 10.7270/Q2J1044C