null
SMILES: O=C(NC1CC1)c1ccc2OCC(Cc2c1)c1nc2ccc(cc2c(=O)[nH]1)-c1cn[nH]c1
InChI Key: InChIKey=VFAIQZQSSKJRCW-UHFFFAOYSA-N
Activity Spreadsheet -- Enzyme Inhibition Constant Data from BindingDB
Found 1 hit for monomerid = 50338703
Trg + Lig
Ki
nM
ΔG°
kcal/mole
IC50
nM
Kd
nM
EC50/IC50
nM
koff
s-1
kon
M-1s-1
pHTemp
°C
Rho-associated protein kinase 2
(Homo sapiens (Human))
BDBM50338703
(CHEMBL1684208 | N-cyclopropyl-3-(4-oxo-6-(1H-pyraz...)
Show SMILES O=C(NC1CC1)c1ccc2OCC(Cc2c1)c1nc2ccc(cc2c(=O)[nH]1)-c1cn[nH]c1
Show InChI InChI=1S/C24H21N5O3/c30-23(27-18-3-4-18)14-2-6-21-15(7-14)8-16(12-32-21)22-28-20-5-1-13(17-10-25-26-11-17)9-19(20)24(31)29-22/h1-2,5-7,9-11,16,18H,3-4,8,12H2,(H,25,26)(H,27,30)(H,28,29,31)
n/an/a 1n/an/an/an/an/an/a
Translational Research Institute
Curated by ChEMBL
Assay Description
Inhibition of ROCK2 by HTRF assay
Bioorg Med Chem Lett 21: 1844-8 (2011)
Article DOI: 10.1016/j.bmcl.2011.01.039
BindingDB Entry DOI: 10.7270/Q20G3KFF