BDBM50339255 (Z/E)-3-(N,N-Dimethylaminomethylene)indolin-2-one::CHEMBL1689595
SMILES: CN(C)C=C1C(=O)Nc2ccccc12
InChI Key: InChIKey=GRHZRAGCCPFBLA-UHFFFAOYSA-N
Data: 1 IC50
Activity Spreadsheet -- Enzyme Inhibition Constant Data from BindingDB
Found 1 hit for monomerid = 50339255
Trg + Lig
Ki
nM
ΔG°
kcal/mole
IC50
nM
Kd
nM
EC50/IC50
nM
koff
s-1
kon
M-1s-1
pHTemp
°C
Falcipain-2
(Plasmodium falciparum)
BDBM50339255
((Z/E)-3-(N,N-Dimethylaminomethylene)indolin-2-one ...)
Show SMILES CN(C)C=C1C(=O)Nc2ccccc12 |w:3.2|
Show InChI InChI=1S/C11H12N2O/c1-13(2)7-9-8-5-3-4-6-10(8)12-11(9)14/h3-7H,1-2H3,(H,12,14)
n/an/a>5.00E+4n/an/an/an/an/an/a
University of Lisbon
Curated by ChEMBL
Assay Description
Inhibition of Plasmodium falciparum falcipain 2 incubated with compound for 10 mins before addition of 25 uM Z-Leu-Arg-AMC substrate by fluorescence ...
Eur J Med Chem 46: 927-33 (2011)
Article DOI: 10.1016/j.ejmech.2011.01.008
BindingDB Entry DOI: 10.7270/Q2ZC8345