BDBM50339272 (Rs)-2-phenylethyl alpha-D-mannopyranosyl sulfoxide::CHEMBL1689634
SMILES: OC[C@H]1O[C@@H]([C@@H](O)[C@@H](O)[C@@H]1O)S(=O)CCc1ccccc1
InChI Key: InChIKey=MXSSIIJFICBNQB-QUXRGVBESA-N
Data: 1 IC50
Activity Spreadsheet -- Enzyme Inhibition Constant Data from BindingDB
Found 1 hit for monomerid = 50339272
Trg + Lig
Ki
nM
ΔG°
kcal/mole
IC50
nM
Kd
nM
EC50/IC50
nM
koff
s-1
kon
M-1s-1
pHTemp
°C
Mannosyl-oligosaccharide alpha-1,2-mannosidase isoform B
(Drosophila melanogaster)
BDBM50339272
((Rs)-2-phenylethyl alpha-D-mannopyranosyl sulfoxid...)
Show SMILES OC[C@H]1O[C@@H]([C@@H](O)[C@@H](O)[C@@H]1O)S(=O)CCc1ccccc1 |r|
Show InChI InChI=1S/C14H20O6S/c15-8-10-11(16)12(17)13(18)14(20-10)21(19)7-6-9-4-2-1-3-5-9/h1-5,10-18H,6-8H2/t10-,11-,12+,13+,14-,21?/m1/s1
Reactome pathway
n/an/a 2.50E+6n/an/an/an/an/an/a
Slovak Academy of Sciences
Curated by ChEMBL
Assay Description
Inhibition of Drosophila melanogaster GM2b by spectrophotometry
Eur J Med Chem 46: 944-52 (2011)
Article DOI: 10.1016/j.ejmech.2011.01.012
BindingDB Entry DOI: 10.7270/Q2MS3TQM