BDBM50339324 CHEMBL1689810::N-{1-Ethyl-1-[4-(trifluoromethyl)phenyl]propyl}-7,7-dimethyl-5-phenyl-4,5,6,7-tetrahydropyrazolo[1,5-a]pyrimidine-3-carboxamide
SMILES: CCC(CC)(NC(=O)c1cnn2c1NC(CC2(C)C)c1ccccc1)c1ccc(cc1)C(F)(F)F
InChI Key: InChIKey=UIEIUOAVASUIBV-UHFFFAOYSA-N
Data: 1 IC50
Activity Spreadsheet -- Enzyme Inhibition Constant Data from BindingDB
Found 1 hit for monomerid = 50339324
Trg + Lig
Ki
nM
ΔG°
kcal/mole
IC50
nM
Kd
nM
EC50/IC50
nM
koff
s-1
kon
M-1s-1
pHTemp
°C
Calcium-sensing receptor (CaSR)
(Homo sapiens (Human))
BDBM50339324
(CHEMBL1689810 | N-{1-Ethyl-1-[4-(trifluoromethyl)p...)
Show SMILES CCC(CC)(NC(=O)c1cnn2c1NC(CC2(C)C)c1ccccc1)c1ccc(cc1)C(F)(F)F
Show InChI InChI=1S/C27H31F3N4O/c1-5-26(6-2,19-12-14-20(15-13-19)27(28,29)30)33-24(35)21-17-31-34-23(21)32-22(16-25(34,3)4)18-10-8-7-9-11-18/h7-15,17,22,32H,5-6,16H2,1-4H3,(H,33,35)
n/an/a 7.60n/an/an/an/an/an/a
Takeda Pharmaceutical Company Limited
Curated by ChEMBL
Assay Description
Inhibition of CaSR expressed in CHO cells incubated with compound for 10 mins measured after 1 hr by [35S]GTPgammaS binding assay
J Med Chem 54: 1430-40 (2011)
Article DOI: 10.1021/jm101452x
BindingDB Entry DOI: 10.7270/Q2K35TZ9