BDBM50339339 4-(1-{[(7,7-Dimethyl-5-phenyl-4,5,6,7-tetrahydropyrazolo[1,5-a]-pyrimidine-3-yl)carbonyl]-amino}-1-ethylpropyl)phenyl Acetate::CHEMBL1688091
SMILES: CCC(CC)(NC(=O)c1cnn2c1NC(CC2(C)C)c1ccccc1)c1ccc(OC(C)=O)cc1
InChI Key: InChIKey=PAVHLCULMYJFGO-UHFFFAOYSA-N
Data: 1 IC50
Activity Spreadsheet -- Enzyme Inhibition Constant Data from BindingDB
Found 1 hit for monomerid = 50339339
Trg + Lig
Ki
nM
ΔG°
kcal/mole
IC50
nM
Kd
nM
EC50/IC50
nM
koff
s-1
kon
M-1s-1
pHTemp
°C
Calcium-sensing receptor (CaSR)
(Homo sapiens (Human))
BDBM50339339
(4-(1-{[(7,7-Dimethyl-5-phenyl-4,5,6,7-tetrahydropy...)
Show SMILES CCC(CC)(NC(=O)c1cnn2c1NC(CC2(C)C)c1ccccc1)c1ccc(OC(C)=O)cc1
Show InChI InChI=1S/C28H34N4O3/c1-6-28(7-2,21-13-15-22(16-14-21)35-19(3)33)31-26(34)23-18-29-32-25(23)30-24(17-27(32,4)5)20-11-9-8-10-12-20/h8-16,18,24,30H,6-7,17H2,1-5H3,(H,31,34)
n/an/a 31n/an/an/an/an/an/a
Takeda Pharmaceutical Company Limited
Curated by ChEMBL
Assay Description
Inhibition of CaSR expressed in CHO cells incubated with compound for 10 mins measured after 1 hr by [35S]GTPgammaS binding assay
J Med Chem 54: 1430-40 (2011)
Article DOI: 10.1021/jm101452x
BindingDB Entry DOI: 10.7270/Q2K35TZ9