BDBM50339355 (+/-)-3-(4-Chlorophenyl)-3-(4-hydroxybutoxy)-2-(4-nitrobenzyl)-2,3-dihydroisoindol-1-one::CHEMBL1688260
SMILES: OCCCCOC1(N(Cc2ccc(cc2)[N+]([O-])=O)C(=O)c2ccccc12)c1ccc(Cl)cc1
InChI Key: InChIKey=MSILRQSPKGOYIL-UHFFFAOYSA-N
Data: 1 IC50
Activity Spreadsheet -- Enzyme Inhibition Constant Data from BindingDB
Found 1 hit for monomerid = 50339355
Trg + Lig
Ki
nM
ΔG°
kcal/mole
IC50
nM
Kd
nM
EC50/IC50
nM
koff
s-1
kon
M-1s-1
pHTemp
°C
E3 ubiquitin-protein ligase Mdm2
(Homo sapiens (Human))
BDBM50339355
((+/-)-3-(4-Chlorophenyl)-3-(4-hydroxybutoxy)-2-(4-...)
Show SMILES OCCCCOC1(N(Cc2ccc(cc2)[N+]([O-])=O)C(=O)c2ccccc12)c1ccc(Cl)cc1
Show InChI InChI=1S/C25H23ClN2O5/c26-20-11-9-19(10-12-20)25(33-16-4-3-15-29)23-6-2-1-5-22(23)24(30)27(25)17-18-7-13-21(14-8-18)28(31)32/h1-2,5-14,29H,3-4,15-17H2
NCI pathway
Reactome pathway
n/an/a 360n/an/an/an/an/an/a
Newcastle University
Curated by ChEMBL
Assay Description
Inhibition of Mdm2 -p53 protein interaction by ELISA
J Med Chem 54: 1233-43 (2011)
Article DOI: 10.1021/jm1011929
BindingDB Entry DOI: 10.7270/Q29K4BHN