BDBM50339610 4-{[7-({[3-(Aminomethyl)-5-(trifluoromethyl)phenyl]amino}carbonyl)-5,6,7,8-tetrahydronaphthalen-2-yl]oxy}-N-methylpyridine-2-carboxamide::CHEMBL1688866
SMILES: CNC(=O)c1cc(Oc2ccc3CCC(Cc3c2)C(=O)Nc2cc(CN)cc(c2)C(F)(F)F)ccn1
InChI Key: InChIKey=GOMBEKULXIGEDP-UHFFFAOYSA-N
Data: 2 IC50
Activity Spreadsheet -- Enzyme Inhibition Constant Data from BindingDB
Found 2 hits for monomerid = 50339610
Trg + Lig
Ki
nM
ΔG°
kcal/mole
IC50
nM
Kd
nM
EC50/IC50
nM
koff
s-1
kon
M-1s-1
pHTemp
°C
RAF proto-oncogene serine/threonine-protein kinase
(Homo sapiens (Human))
BDBM50339610
(4-{[7-({[3-(Aminomethyl)-5-(trifluoromethyl)phenyl...)
Show SMILES CNC(=O)c1cc(Oc2ccc3CCC(Cc3c2)C(=O)Nc2cc(CN)cc(c2)C(F)(F)F)ccn1
Show InChI InChI=1S/C26H25F3N4O3/c1-31-25(35)23-13-22(6-7-32-23)36-21-5-4-16-2-3-17(10-18(16)11-21)24(34)33-20-9-15(14-30)8-19(12-20)26(27,28)29/h4-9,11-13,17H,2-3,10,14,30H2,1H3,(H,31,35)(H,33,34)
NCI pathway
Reactome pathway
n/an/a 11n/an/an/an/an/an/a
Millennium Pharmaceuticals, Inc.
Curated by ChEMBL
Assay Description
Inhibition of C-Raf assessed as reduction in [33P]ATP incorporation into biotinylated substrate peptide after 3 hrs by flash plate assay
J Med Chem 54: 1836-46 (2011)
Article DOI: 10.1021/jm101479y
BindingDB Entry DOI: 10.7270/Q2DB824F
RAF proto-oncogene serine/threonine-protein kinase
(Homo sapiens (Human))
BDBM50339610
(4-{[7-({[3-(Aminomethyl)-5-(trifluoromethyl)phenyl...)
Show SMILES CNC(=O)c1cc(Oc2ccc3CCC(Cc3c2)C(=O)Nc2cc(CN)cc(c2)C(F)(F)F)ccn1
Show InChI InChI=1S/C26H25F3N4O3/c1-31-25(35)23-13-22(6-7-32-23)36-21-5-4-16-2-3-17(10-18(16)11-21)24(34)33-20-9-15(14-30)8-19(12-20)26(27,28)29/h4-9,11-13,17H,2-3,10,14,30H2,1H3,(H,31,35)(H,33,34)
NCI pathway
Reactome pathway
n/an/a 1.40E+3n/an/an/an/an/an/a
Millennium Pharmaceuticals, Inc.
Curated by ChEMBL
Assay Description
Inhibition of raf kinase in human A375 cells assessed as decrease in MEK-mediated ERK phosphorylation after 3 hrs using 3,3',5,5'-tetramethylbenzidin...
J Med Chem 54: 1836-46 (2011)
Article DOI: 10.1021/jm101479y
BindingDB Entry DOI: 10.7270/Q2DB824F