BDBM50339616 7-({2-[(Cyclopropylcarbonyl)amino]pyridin-4-yl}oxy)-N-[3-[(isopropylamino)methyl]-5-(trifluoromethyl)phenyl]-1,2,3,4-tetrahydronaphthalene-2-carboxamide::CHEMBL1688872
SMILES: CC(C)NCc1cc(NC(=O)C2CCc3ccc(Oc4ccnc(NC(=O)C5CC5)c4)cc3C2)cc(c1)C(F)(F)F
InChI Key: InChIKey=CFHYBQICSRKUFF-UHFFFAOYSA-N
Data: 2 IC50
Activity Spreadsheet -- Enzyme Inhibition Constant Data from BindingDB
Found 2 hits for monomerid = 50339616
Trg + Lig
Ki
nM
ΔG°
kcal/mole
IC50
nM
Kd
nM
EC50/IC50
nM
koff
s-1
kon
M-1s-1
pHTemp
°C
RAF proto-oncogene serine/threonine-protein kinase
(Homo sapiens (Human))
BDBM50339616
(7-({2-[(Cyclopropylcarbonyl)amino]pyridin-4-yl}oxy...)
Show SMILES CC(C)NCc1cc(NC(=O)C2CCc3ccc(Oc4ccnc(NC(=O)C5CC5)c4)cc3C2)cc(c1)C(F)(F)F
Show InChI InChI=1S/C31H33F3N4O3/c1-18(2)36-17-19-11-24(31(32,33)34)15-25(12-19)37-30(40)22-6-3-20-7-8-26(14-23(20)13-22)41-27-9-10-35-28(16-27)38-29(39)21-4-5-21/h7-12,14-16,18,21-22,36H,3-6,13,17H2,1-2H3,(H,37,40)(H,35,38,39)
NCI pathway
Reactome pathway
n/an/a 4.60n/an/an/an/an/an/a
Millennium Pharmaceuticals, Inc.
Curated by ChEMBL
Assay Description
Inhibition of C-Raf assessed as reduction in [33P]ATP incorporation into biotinylated substrate peptide after 3 hrs by flash plate assay
J Med Chem 54: 1836-46 (2011)
Article DOI: 10.1021/jm101479y
BindingDB Entry DOI: 10.7270/Q2DB824F
RAF proto-oncogene serine/threonine-protein kinase
(Homo sapiens (Human))
BDBM50339616
(7-({2-[(Cyclopropylcarbonyl)amino]pyridin-4-yl}oxy...)
Show SMILES CC(C)NCc1cc(NC(=O)C2CCc3ccc(Oc4ccnc(NC(=O)C5CC5)c4)cc3C2)cc(c1)C(F)(F)F
Show InChI InChI=1S/C31H33F3N4O3/c1-18(2)36-17-19-11-24(31(32,33)34)15-25(12-19)37-30(40)22-6-3-20-7-8-26(14-23(20)13-22)41-27-9-10-35-28(16-27)38-29(39)21-4-5-21/h7-12,14-16,18,21-22,36H,3-6,13,17H2,1-2H3,(H,37,40)(H,35,38,39)
NCI pathway
Reactome pathway
n/an/a 190n/an/an/an/an/an/a
Millennium Pharmaceuticals, Inc.
Curated by ChEMBL
Assay Description
Inhibition of raf kinase in human A375 cells assessed as decrease in MEK-mediated ERK phosphorylation after 3 hrs using 3,3',5,5'-tetramethylbenzidin...
J Med Chem 54: 1836-46 (2011)
Article DOI: 10.1021/jm101479y
BindingDB Entry DOI: 10.7270/Q2DB824F