BDBM50339618 (2S)-N-[3-(2-aminopropan-2-yl)-5-(trifluoromethyl)phenyl]-7-[(7-oxo-5,6,7,8-tetrahydro-1,8-naphthyridin-4-yl)oxy]-1,2,3,4-tetrahydronaphthalene-2-carboxamide::CHEMBL1614728
SMILES: CC(C)(N)c1cc(NC(=O)[C@H]2CCc3ccc(Oc4ccnc5NC(=O)CCc45)cc3C2)cc(c1)C(F)(F)F
InChI Key: InChIKey=NHVJQLRLGGPUJY-KRWDZBQOSA-N
Data: 1 IC50
PDB links: 1 PDB ID matches this monomer.
Activity Spreadsheet -- Enzyme Inhibition Constant Data from BindingDB
Found 1 hit for monomerid = 50339618
Trg + Lig
Ki
nM
ΔG°
kcal/mole
IC50
nM
Kd
nM
EC50/IC50
nM
koff
s-1
kon
M-1s-1
pHTemp
°C
RAF proto-oncogene serine/threonine-protein kinase
(Homo sapiens (Human))
BDBM50339618
((2S)-N-[3-(2-aminopropan-2-yl)-5-(trifluoromethyl)...)
Show SMILES CC(C)(N)c1cc(NC(=O)[C@H]2CCc3ccc(Oc4ccnc5NC(=O)CCc45)cc3C2)cc(c1)C(F)(F)F |r|
Show InChI InChI=1S/C29H29F3N4O3/c1-28(2,33)19-13-20(29(30,31)32)15-21(14-19)35-27(38)17-4-3-16-5-6-22(12-18(16)11-17)39-24-9-10-34-26-23(24)7-8-25(37)36-26/h5-6,9-10,12-15,17H,3-4,7-8,11,33H2,1-2H3,(H,35,38)(H,34,36,37)/t17-/m0/s1
NCI pathway
Reactome pathway
n/an/a 79n/an/an/an/an/an/a
Millennium Pharmaceuticals, Inc.
Curated by ChEMBL
Assay Description
Inhibition of raf kinase in human A375 cells assessed as decrease in MEK-mediated ERK phosphorylation after 3 hrs using 3,3',5,5'-tetramethylbenzidin...
J Med Chem 54: 1836-46 (2011)
Article DOI: 10.1021/jm101479y
BindingDB Entry DOI: 10.7270/Q2DB824F