BDBM50339807 CHEMBL1689277::N-[(3beta,18beta,20beta)-3-(Acetoxy)-11-oxo-30-norolean-12-en-20-yl]-N'-[(trifluoromethyl)sulfonyl]urea
SMILES: CC(=O)O[C@H]1CC[C@@]2(C)[C@@H](CC[C@]3(C)[C@@H]2C(=O)C=C2[C@@H]4C[C@](C)(CC[C@]4(C)CC[C@@]32C)NC(=O)NS(=O)(=O)C(F)(F)F)C1(C)C
InChI Key: InChIKey=WAYRKSNQTDOQAT-XWEVEMRCSA-N
Data: 2 IC50
Activity Spreadsheet -- Enzyme Inhibition Constant Data from BindingDB
Found 2 hits for monomerid = 50339807
Trg + Lig
Ki
nM
ΔG°
kcal/mole
IC50
nM
Kd
nM
EC50/IC50
nM
koff
s-1
kon
M-1s-1
pHTemp
°C
11-beta-hydroxysteroid dehydrogenase 2
(Homo sapiens (Human))
BDBM50339807
(CHEMBL1689277 | N-[(3beta,18beta,20beta)-3-(Acetox...)
Show SMILES CC(=O)O[C@H]1CC[C@@]2(C)[C@@H](CC[C@]3(C)[C@@H]2C(=O)C=C2[C@@H]4C[C@](C)(CC[C@]4(C)CC[C@@]32C)NC(=O)NS(=O)(=O)C(F)(F)F)C1(C)C |r,t:18|
Show InChI InChI=1S/C33H49F3N2O6S/c1-19(39)44-24-10-11-30(6)23(27(24,2)3)9-12-32(8)25(30)22(40)17-20-21-18-29(5,15-13-28(21,4)14-16-31(20,32)7)37-26(41)38-45(42,43)33(34,35)36/h17,21,23-25H,9-16,18H2,1-8H3,(H2,37,38,41)/t21-,23-,24-,25+,28+,29-,30-,31+,32+/m0/s1
n/an/a 194n/an/an/an/an/an/a
University of Technology
Curated by ChEMBL
Assay Description
Inhibition of human 11beta-HSD2 expressed in HEK293 cells assessed as conversion of [1,2,6,7-[3H]cortisol to cortisone after 10 mins by scintillation...
Bioorg Med Chem 19: 1866-80 (2011)
Article DOI: 10.1016/j.bmc.2011.02.005
BindingDB Entry DOI: 10.7270/Q2VD6ZR7
11-beta-hydroxysteroid dehydrogenase 1
(Homo sapiens (Human))
BDBM50339807
(CHEMBL1689277 | N-[(3beta,18beta,20beta)-3-(Acetox...)
Show SMILES CC(=O)O[C@H]1CC[C@@]2(C)[C@@H](CC[C@]3(C)[C@@H]2C(=O)C=C2[C@@H]4C[C@](C)(CC[C@]4(C)CC[C@@]32C)NC(=O)NS(=O)(=O)C(F)(F)F)C1(C)C |r,t:18|
Show InChI InChI=1S/C33H49F3N2O6S/c1-19(39)44-24-10-11-30(6)23(27(24,2)3)9-12-32(8)25(30)22(40)17-20-21-18-29(5,15-13-28(21,4)14-16-31(20,32)7)37-26(41)38-45(42,43)33(34,35)36/h17,21,23-25H,9-16,18H2,1-8H3,(H2,37,38,41)/t21-,23-,24-,25+,28+,29-,30-,31+,32+/m0/s1
Reactome pathway
n/an/a 4.00E+3n/an/an/an/an/an/a
University of Technology
Curated by ChEMBL
Assay Description
Inhibition of human recombinant 11beta-HSD1 expressed in HEK293 cells assessed as conversion of [1,2-[3H]cortisone to cortisol after 10 mins by scint...
Bioorg Med Chem 19: 1866-80 (2011)
Article DOI: 10.1016/j.bmc.2011.02.005
BindingDB Entry DOI: 10.7270/Q2VD6ZR7