BDBM50339879 (R)-3-(1-(4-(benzofuran-2-yl)pyrimidin-2-yl)piperidin-3-yl)-1-ethyl-1H-imidazo[4,5-b]pyridin-2(3H)-one::CHEMBL1761284
SMILES: CCn1c2cccnc2n([C@@H]2CCCN(C2)c2nccc(n2)-c2cc3ccccc3o2)c1=O
InChI Key: InChIKey=IDXXQXPYKNNTDF-GOSISDBHSA-N
Data: 2 IC50
Activity Spreadsheet -- Enzyme Inhibition Constant Data from BindingDB
Found 2 hits for monomerid = 50339879
Trg + Lig
Ki
nM
ΔG°
kcal/mole
IC50
nM
Kd
nM
EC50/IC50
nM
koff
s-1
kon
M-1s-1
pHTemp
°C
Fatty-acid amide hydrolase 1 (aa 30-579)
(Rattus norvegicus (rat))
BDBM50339879
((R)-3-(1-(4-(benzofuran-2-yl)pyrimidin-2-yl)piperi...)
Show SMILES CCn1c2cccnc2n([C@@H]2CCCN(C2)c2nccc(n2)-c2cc3ccccc3o2)c1=O |r|
Show InChI InChI=1S/C25H24N6O2/c1-2-30-20-9-5-12-26-23(20)31(25(30)32)18-8-6-14-29(16-18)24-27-13-11-19(28-24)22-15-17-7-3-4-10-21(17)33-22/h3-5,7,9-13,15,18H,2,6,8,14,16H2,1H3/t18-/m1/s1
n/an/a 10n/an/an/an/an/an/a
Amgen Inc.
Curated by ChEMBL
Assay Description
Inhibition of rat FAAH assessed as hydrolysis of anandamidoaminomethylcumarin
Bioorg Med Chem Lett 21: 2492-6 (2011)
Article DOI: 10.1016/j.bmcl.2011.02.052
BindingDB Entry DOI: 10.7270/Q2BG2P9M
Fatty-acid amide hydrolase 1
(Homo sapiens (Human))
BDBM50339879
((R)-3-(1-(4-(benzofuran-2-yl)pyrimidin-2-yl)piperi...)
Show SMILES CCn1c2cccnc2n([C@@H]2CCCN(C2)c2nccc(n2)-c2cc3ccccc3o2)c1=O |r|
Show InChI InChI=1S/C25H24N6O2/c1-2-30-20-9-5-12-26-23(20)31(25(30)32)18-8-6-14-29(16-18)24-27-13-11-19(28-24)22-15-17-7-3-4-10-21(17)33-22/h3-5,7,9-13,15,18H,2,6,8,14,16H2,1H3/t18-/m1/s1
n/an/a 9n/an/an/an/an/an/a
Amgen Inc.
Curated by ChEMBL
Assay Description
Inhibition of human FAAH assessed as hydrolysis of anandamidoaminomethylcumarin
Bioorg Med Chem Lett 21: 2492-6 (2011)
Article DOI: 10.1016/j.bmcl.2011.02.052
BindingDB Entry DOI: 10.7270/Q2BG2P9M