BDBM50339883 (S)-1-ethyl-3-(1-(2-(4-fluorophenyl)pyrimidin-4-yl)piperidin-3-yl)-1H-benzo[d]imidazol-2(3H)-one::CHEMBL1761295
SMILES: CCn1c2ccccc2n([C@H]2CCCN(C2)c2ccnc(n2)-c2ccc(F)cc2)c1=O
InChI Key: InChIKey=WCHKBNSTCRGDQJ-IBGZPJMESA-N
Data: 2 IC50
Activity Spreadsheet -- Enzyme Inhibition Constant Data from BindingDB
Found 2 hits for monomerid = 50339883
Trg + Lig
Ki
nM
ΔG°
kcal/mole
IC50
nM
Kd
nM
EC50/IC50
nM
koff
s-1
kon
M-1s-1
pHTemp
°C
Fatty-acid amide hydrolase 1 (aa 30-579)
(Rattus norvegicus (rat))
BDBM50339883
((S)-1-ethyl-3-(1-(2-(4-fluorophenyl)pyrimidin-4-yl...)
Show SMILES CCn1c2ccccc2n([C@H]2CCCN(C2)c2ccnc(n2)-c2ccc(F)cc2)c1=O |r|
Show InChI InChI=1S/C24H24FN5O/c1-2-29-20-7-3-4-8-21(20)30(24(29)31)19-6-5-15-28(16-19)22-13-14-26-23(27-22)17-9-11-18(25)12-10-17/h3-4,7-14,19H,2,5-6,15-16H2,1H3/t19-/m0/s1
n/an/a 120n/an/an/an/an/an/a
Amgen Inc.
Curated by ChEMBL
Assay Description
Inhibition of rat FAAH assessed as hydrolysis of anandamidoaminomethylcumarin
Bioorg Med Chem Lett 21: 2492-6 (2011)
Article DOI: 10.1016/j.bmcl.2011.02.052
BindingDB Entry DOI: 10.7270/Q2BG2P9M
Fatty-acid amide hydrolase 1
(Homo sapiens (Human))
BDBM50339883
((S)-1-ethyl-3-(1-(2-(4-fluorophenyl)pyrimidin-4-yl...)
Show SMILES CCn1c2ccccc2n([C@H]2CCCN(C2)c2ccnc(n2)-c2ccc(F)cc2)c1=O |r|
Show InChI InChI=1S/C24H24FN5O/c1-2-29-20-7-3-4-8-21(20)30(24(29)31)19-6-5-15-28(16-19)22-13-14-26-23(27-22)17-9-11-18(25)12-10-17/h3-4,7-14,19H,2,5-6,15-16H2,1H3/t19-/m0/s1
n/an/a 10n/an/an/an/an/an/a
Amgen Inc.
Curated by ChEMBL
Assay Description
Inhibition of human FAAH assessed as hydrolysis of anandamidoaminomethylcumarin
Bioorg Med Chem Lett 21: 2492-6 (2011)
Article DOI: 10.1016/j.bmcl.2011.02.052
BindingDB Entry DOI: 10.7270/Q2BG2P9M