BDBM50339916 CHEMBL1761660::trans-rac-7-chloro-1-isobutyl-5-(2-methoxyphenyl)-3-(2-oxo-2-(piperidin-1-yl)ethyl)-4,5-dihydro-1H-benzo[d]azepin-2(3H)-one
SMILES: COc1ccccc1[C@H]1CN(CC(=O)N2CCCCC2)C(=O)[C@H](CC(C)C)c2ccc(Cl)cc12
InChI Key: InChIKey=VMCQFERNKVBDRT-JWQCQUIFSA-N
Data: 1 IC50
Activity Spreadsheet -- Enzyme Inhibition Constant Data from BindingDB
Found 1 hit for monomerid = 50339916
Trg + Lig
Ki
nM
ΔG°
kcal/mole
IC50
nM
Kd
nM
EC50/IC50
nM
koff
s-1
kon
M-1s-1
pHTemp
°C
Squalene synthetase
(Homo sapiens (Human))
BDBM50339916
(CHEMBL1761660 | trans-rac-7-chloro-1-isobutyl-5-(2...)
Show SMILES COc1ccccc1[C@H]1CN(CC(=O)N2CCCCC2)C(=O)[C@H](CC(C)C)c2ccc(Cl)cc12 |r|
Show InChI InChI=1S/C28H35ClN2O3/c1-19(2)15-24-21-12-11-20(29)16-23(21)25(22-9-5-6-10-26(22)34-3)17-31(28(24)33)18-27(32)30-13-7-4-8-14-30/h5-6,9-12,16,19,24-25H,4,7-8,13-15,17-18H2,1-3H3/t24-,25-/m1/s1
Reactome pathway
n/an/a 370n/an/an/an/an/an/a
Bayer Pharma AG
Curated by ChEMBL
Assay Description
Inhibition of squalene synthase assessed as conversion of [3H]farnesyl phosphate to [3H]squalene after 10 mins by scintillation counting
Bioorg Med Chem Lett 21: 2554-8 (2011)
Article DOI: 10.1016/j.bmcl.2011.02.004
BindingDB Entry DOI: 10.7270/Q22Z15VJ