BDBM50340111 CHEMBL1762829::rac-14-(3'-Methoxyphenyl)-10,11,12,14-tetrahydro-9H-benzo[5,6]chromeno[2,3-b]quinolin-13-amine
SMILES: COc1cccc(c1)C1c2c(N)c3CCCCc3nc2Oc2ccc3ccccc3c12
InChI Key: InChIKey=KSDJTELWHBDLIN-UHFFFAOYSA-N
Data: 2 IC50
Activity Spreadsheet -- Enzyme Inhibition Constant Data from BindingDB
Found 2 hits for monomerid = 50340111
Trg + Lig
Ki
nM
ΔG°
kcal/mole
IC50
nM
Kd
nM
EC50/IC50
nM
koff
s-1
kon
M-1s-1
pHTemp
°C
Butyrylcholinesterase (BuChE)
(Equus caballus (Horse))
BDBM50340111
(CHEMBL1762829 | rac-14-(3'-Methoxyphenyl)-10,11,12...)
Show SMILES COc1cccc(c1)C1c2c(N)c3CCCCc3nc2Oc2ccc3ccccc3c12
Show InChI InChI=1S/C27H24N2O2/c1-30-18-9-6-8-17(15-18)23-24-19-10-3-2-7-16(19)13-14-22(24)31-27-25(23)26(28)20-11-4-5-12-21(20)29-27/h2-3,6-10,13-15,23H,4-5,11-12H2,1H3,(H2,28,29)
n/an/a>1.00E+4n/an/an/an/an/an/a
Universit£ de Sfax
Curated by ChEMBL
Assay Description
Inhibition of horse serum butrylcholinesterase preincubated with compound for 10 mins using butrylcholine iodide as substrate after 15 mins by spectr...
Bioorg Med Chem Lett 21: 2384-8 (2011)
Article DOI: 10.1016/j.bmcl.2011.02.094
BindingDB Entry DOI: 10.7270/Q2D79BQQ
Acetylcholinesterase
(Electrophorus electricus (Electric eel))
BDBM50340111
(CHEMBL1762829 | rac-14-(3'-Methoxyphenyl)-10,11,12...)
Show SMILES COc1cccc(c1)C1c2c(N)c3CCCCc3nc2Oc2ccc3ccccc3c12
Show InChI InChI=1S/C27H24N2O2/c1-30-18-9-6-8-17(15-18)23-24-19-10-3-2-7-16(19)13-14-22(24)31-27-25(23)26(28)20-11-4-5-12-21(20)29-27/h2-3,6-10,13-15,23H,4-5,11-12H2,1H3,(H2,28,29)
n/an/a 16n/an/an/an/an/an/a
Universit£ de Sfax
Curated by ChEMBL
Assay Description
Inhibition of Electrophorus electricus acetylcholinesterase preincubated with compound for 10 mins using acetylcholine iodide as substrate after 15 m...
Bioorg Med Chem Lett 21: 2384-8 (2011)
Article DOI: 10.1016/j.bmcl.2011.02.094
BindingDB Entry DOI: 10.7270/Q2D79BQQ