BDBM50340119 CHEMBL1760033::N2-(quinolin-3-yl)-N4-(3,4,5-trimethoxyphenyl)-1,3,5-triazine-2,4-diamine
SMILES: COc1cc(Nc2ncnc(Nc3cnc4ccccc4c3)n2)cc(OC)c1OC
InChI Key: InChIKey=MTMFBNKTKJENJB-UHFFFAOYSA-N
Data: 2 IC50
Activity Spreadsheet -- Enzyme Inhibition Constant Data from BindingDB
Found 2 hits for monomerid = 50340119
Trg + Lig
Ki
nM
ΔG°
kcal/mole
IC50
nM
Kd
nM
EC50/IC50
nM
koff
s-1
kon
M-1s-1
pHTemp
°C
Insulin-like growth factor I receptor
(Homo sapiens (Human))
BDBM50340119
(CHEMBL1760033 | N2-(quinolin-3-yl)-N4-(3,4,5-trime...)
Show SMILES COc1cc(Nc2ncnc(Nc3cnc4ccccc4c3)n2)cc(OC)c1OC
Show InChI InChI=1S/C21H20N6O3/c1-28-17-9-14(10-18(29-2)19(17)30-3)25-20-23-12-24-21(27-20)26-15-8-13-6-4-5-7-16(13)22-11-15/h4-12H,1-3H3,(H2,23,24,25,26,27)
Reactome pathway
n/an/a 175n/an/an/an/an/an/a
Amgen Inc.
Curated by ChEMBL
Assay Description
Inhibition of IGF1-induced human IGF1R auto phosphorylation expressed in mouse NIH-3T3 cells preincubated with compound for 1 hr
Bioorg Med Chem Lett 21: 2394-9 (2011)
Article DOI: 10.1016/j.bmcl.2011.02.075
BindingDB Entry DOI: 10.7270/Q28G8M0D
Insulin-like growth factor I receptor
(Homo sapiens (Human))
BDBM50340119
(CHEMBL1760033 | N2-(quinolin-3-yl)-N4-(3,4,5-trime...)
Show SMILES COc1cc(Nc2ncnc(Nc3cnc4ccccc4c3)n2)cc(OC)c1OC
Show InChI InChI=1S/C21H20N6O3/c1-28-17-9-14(10-18(29-2)19(17)30-3)25-20-23-12-24-21(27-20)26-15-8-13-6-4-5-7-16(13)22-11-15/h4-12H,1-3H3,(H2,23,24,25,26,27)
Reactome pathway
n/an/a 41n/an/an/an/an/an/a
Amgen Inc.
Curated by ChEMBL
Assay Description
Inhibition of human IGF1R
Bioorg Med Chem Lett 21: 2394-9 (2011)
Article DOI: 10.1016/j.bmcl.2011.02.075
BindingDB Entry DOI: 10.7270/Q28G8M0D