BDBM50340128 CHEMBL1760041::N4-(quinolin-6-yl)-N2-(3,4,5-trimethoxyphenyl)pyrimidine-2,4-diamine
SMILES: COc1cc(Nc2nccc(Nc3ccc4ncccc4c3)n2)cc(OC)c1OC
InChI Key: InChIKey=QZNAGOWOUWHEEI-UHFFFAOYSA-N
Data: 2 IC50
Activity Spreadsheet -- Enzyme Inhibition Constant Data from BindingDB
Found 2 hits for monomerid = 50340128
Trg + Lig
Ki
nM
ΔG°
kcal/mole
IC50
nM
Kd
nM
EC50/IC50
nM
koff
s-1
kon
M-1s-1
pHTemp
°C
Insulin-like growth factor I receptor
(Homo sapiens (Human))
BDBM50340128
(CHEMBL1760041 | N4-(quinolin-6-yl)-N2-(3,4,5-trime...)
Show SMILES COc1cc(Nc2nccc(Nc3ccc4ncccc4c3)n2)cc(OC)c1OC
Show InChI InChI=1S/C22H21N5O3/c1-28-18-12-16(13-19(29-2)21(18)30-3)26-22-24-10-8-20(27-22)25-15-6-7-17-14(11-15)5-4-9-23-17/h4-13H,1-3H3,(H2,24,25,26,27)
Reactome pathway
n/an/a 3.30n/an/an/an/an/an/a
Amgen Inc.
Curated by ChEMBL
Assay Description
Inhibition of human IGF1R
Bioorg Med Chem Lett 21: 2394-9 (2011)
Article DOI: 10.1016/j.bmcl.2011.02.075
BindingDB Entry DOI: 10.7270/Q28G8M0D
Insulin-like growth factor I receptor
(Homo sapiens (Human))
BDBM50340128
(CHEMBL1760041 | N4-(quinolin-6-yl)-N2-(3,4,5-trime...)
Show SMILES COc1cc(Nc2nccc(Nc3ccc4ncccc4c3)n2)cc(OC)c1OC
Show InChI InChI=1S/C22H21N5O3/c1-28-18-12-16(13-19(29-2)21(18)30-3)26-22-24-10-8-20(27-22)25-15-6-7-17-14(11-15)5-4-9-23-17/h4-13H,1-3H3,(H2,24,25,26,27)
Reactome pathway
n/an/a 37n/an/an/an/an/an/a
Amgen Inc.
Curated by ChEMBL
Assay Description
Inhibition of IGF1-induced human IGF1R auto phosphorylation expressed in mouse NIH-3T3 cells preincubated with compound for 1 hr
Bioorg Med Chem Lett 21: 2394-9 (2011)
Article DOI: 10.1016/j.bmcl.2011.02.075
BindingDB Entry DOI: 10.7270/Q28G8M0D