BDBM50340135 CHEMBL1760049::N2-(3,4-dimethoxyphenyl)-N4-(quinolin-3-yl)pyrimidine-2,4-diamine
SMILES: COc1ccc(Nc2nccc(Nc3cnc4ccccc4c3)n2)cc1OC
InChI Key: InChIKey=KKZHTAYUVGTMSF-UHFFFAOYSA-N
Data: 2 IC50
Activity Spreadsheet -- Enzyme Inhibition Constant Data from BindingDB
Found 2 hits for monomerid = 50340135
Trg + Lig
Ki
nM
ΔG°
kcal/mole
IC50
nM
Kd
nM
EC50/IC50
nM
koff
s-1
kon
M-1s-1
pHTemp
°C
Insulin-like growth factor I receptor
(Homo sapiens (Human))
BDBM50340135
(CHEMBL1760049 | N2-(3,4-dimethoxyphenyl)-N4-(quino...)
Show SMILES COc1ccc(Nc2nccc(Nc3cnc4ccccc4c3)n2)cc1OC
Show InChI InChI=1S/C21H19N5O2/c1-27-18-8-7-15(12-19(18)28-2)25-21-22-10-9-20(26-21)24-16-11-14-5-3-4-6-17(14)23-13-16/h3-13H,1-2H3,(H2,22,24,25,26)
Reactome pathway
n/an/a 18n/an/an/an/an/an/a
Amgen Inc.
Curated by ChEMBL
Assay Description
Inhibition of human IGF1R
Bioorg Med Chem Lett 21: 2394-9 (2011)
Article DOI: 10.1016/j.bmcl.2011.02.075
BindingDB Entry DOI: 10.7270/Q28G8M0D
Insulin-like growth factor I receptor
(Homo sapiens (Human))
BDBM50340135
(CHEMBL1760049 | N2-(3,4-dimethoxyphenyl)-N4-(quino...)
Show SMILES COc1ccc(Nc2nccc(Nc3cnc4ccccc4c3)n2)cc1OC
Show InChI InChI=1S/C21H19N5O2/c1-27-18-8-7-15(12-19(18)28-2)25-21-22-10-9-20(26-21)24-16-11-14-5-3-4-6-17(14)23-13-16/h3-13H,1-2H3,(H2,22,24,25,26)
Reactome pathway
n/an/a 507n/an/an/an/an/an/a
Amgen Inc.
Curated by ChEMBL
Assay Description
Inhibition of IGF1-induced human IGF1R auto phosphorylation expressed in mouse NIH-3T3 cells preincubated with compound for 1 hr
Bioorg Med Chem Lett 21: 2394-9 (2011)
Article DOI: 10.1016/j.bmcl.2011.02.075
BindingDB Entry DOI: 10.7270/Q28G8M0D