BDBM50340247 CHEMBL1760600
SMILES: Cc1c2CCCNCC(C)(C)CNc3cc(ccc3C(N)=O)-n2c2CC(C)(C)CC(=O)c12
InChI Key: InChIKey=JCTMDPHVBFNGBT-UHFFFAOYSA-N
Data: 1 IC50
Activity Spreadsheet -- Enzyme Inhibition Constant Data from BindingDB
Found 1 hit for monomerid = 50340247
Trg + Lig
Ki
nM
ΔG°
kcal/mole
IC50
nM
Kd
nM
EC50/IC50
nM
koff
s-1
kon
M-1s-1
pHTemp
°C
Heat shock protein HSP 90-alpha
(Homo sapiens (Human))
BDBM50340247
(CHEMBL1760600)
Show SMILES Cc1c2CCCNCC(C)(C)CNc3cc(ccc3C(N)=O)-n2c2CC(C)(C)CC(=O)c12
Show InChI InChI=1S/C26H36N4O2/c1-16-20-7-6-10-28-14-26(4,5)15-29-19-11-17(8-9-18(19)24(27)32)30(20)21-12-25(2,3)13-22(31)23(16)21/h8-9,11,28-29H,6-7,10,12-15H2,1-5H3,(H2,27,32)
NCI pathway
Reactome pathway
n/an/a 290n/an/an/an/an/an/a
Pfizer Inc.
Curated by ChEMBL
Assay Description
Inhibition of Hsp90alpha after 3 hrs by fluorescence polarization assay
Bioorg Med Chem Lett 21: 2278-82 (2011)
Article DOI: 10.1016/j.bmcl.2011.02.101
BindingDB Entry DOI: 10.7270/Q2RF5VBN