BDBM50340286 CHEMBL1760615::N-methyl-7-(2-(3-(3-(trifluoromethyl)phenyl)ureido)ethyl)isoquinoline-3-carboxamide
SMILES: CNC(=O)c1cc2ccc(CCNC(=O)Nc3cccc(c3)C(F)(F)F)cc2cn1
InChI Key: InChIKey=CHURZEVSSHLAGS-UHFFFAOYSA-N
Data: 1 IC50
Activity Spreadsheet -- Enzyme Inhibition Constant Data from BindingDB
Found 1 hit for monomerid = 50340286
Trg + Lig
Ki
nM
ΔG°
kcal/mole
IC50
nM
Kd
nM
EC50/IC50
nM
koff
s-1
kon
M-1s-1
pHTemp
°C
RAF proto-oncogene serine/threonine-protein kinase
(Homo sapiens (Human))
BDBM50340286
(CHEMBL1760615 | N-methyl-7-(2-(3-(3-(trifluorometh...)
Show SMILES CNC(=O)c1cc2ccc(CCNC(=O)Nc3cccc(c3)C(F)(F)F)cc2cn1
Show InChI InChI=1S/C21H19F3N4O2/c1-25-19(29)18-10-14-6-5-13(9-15(14)12-27-18)7-8-26-20(30)28-17-4-2-3-16(11-17)21(22,23)24/h2-6,9-12H,7-8H2,1H3,(H,25,29)(H2,26,28,30)
NCI pathway
Reactome pathway
n/an/a 360n/an/an/an/an/an/a
Merck Serono
Curated by ChEMBL
Assay Description
Inhibition of human cRAF using [gamma-33P-ATP] as a substrate by scintillation counting
Bioorg Med Chem Lett 21: 2264-9 (2011)
Article DOI: 10.1016/j.bmcl.2011.02.108
BindingDB Entry DOI: 10.7270/Q2MS3T23