BDBM50340318 (R)-3-morpholino-N-(2,2,2-trifluoro-1-(pyridin-2-yl)ethyl)imidazo[1,5-a]pyridine-1-carboxamide::CHEMBL1760938
SMILES: FC(F)(F)[C@H](NC(=O)c1nc(N2CCOCC2)n2ccccc12)c1ccccn1
InChI Key: InChIKey=FKNCVLQSUDOQES-MRXNPFEDSA-N
Data: 2 IC50
Activity Spreadsheet -- Enzyme Inhibition Constant Data from BindingDB
Found 2 hits for monomerid = 50340318
Trg + Lig
Ki
nM
ΔG°
kcal/mole
IC50
nM
Kd
nM
EC50/IC50
nM
koff
s-1
kon
M-1s-1
pHTemp
°C
Cannabinoid receptor 1
(Homo sapiens (Human))
BDBM50340318
((R)-3-morpholino-N-(2,2,2-trifluoro-1-(pyridin-2-y...)
Show SMILES FC(F)(F)[C@H](NC(=O)c1nc(N2CCOCC2)n2ccccc12)c1ccccn1 |r|
Show InChI InChI=1S/C19H18F3N5O2/c20-19(21,22)16(13-5-1-3-7-23-13)25-17(28)15-14-6-2-4-8-27(14)18(24-15)26-9-11-29-12-10-26/h1-8,16H,9-12H2,(H,25,28)/t16-/m1/s1
NCI pathway
Reactome pathway
n/an/a 705n/an/an/an/an/an/a
Merck Research Laboratories
Curated by ChEMBL
Assay Description
Agonist activity at human CB1 receptor expressed in CHO-K1 cells assessed as inhibition of forskolin-stimulated cAMP level
Bioorg Med Chem Lett 21: 2354-8 (2011)
Article DOI: 10.1016/j.bmcl.2011.02.082
BindingDB Entry DOI: 10.7270/Q2C829MB
Cannabinoid receptor 2
(Homo sapiens (Human))
BDBM50340318
((R)-3-morpholino-N-(2,2,2-trifluoro-1-(pyridin-2-y...)
Show SMILES FC(F)(F)[C@H](NC(=O)c1nc(N2CCOCC2)n2ccccc12)c1ccccn1 |r|
Show InChI InChI=1S/C19H18F3N5O2/c20-19(21,22)16(13-5-1-3-7-23-13)25-17(28)15-14-6-2-4-8-27(14)18(24-15)26-9-11-29-12-10-26/h1-8,16H,9-12H2,(H,25,28)/t16-/m1/s1
Reactome pathway
n/an/a 21n/an/an/an/an/an/a
Merck Research Laboratories
Curated by ChEMBL
Assay Description
Agonist activity at human CB2 receptor expressed in CHO-K1 cells assessed as inhibition of forskolin-stimulated cAMP level
Bioorg Med Chem Lett 21: 2354-8 (2011)
Article DOI: 10.1016/j.bmcl.2011.02.082
BindingDB Entry DOI: 10.7270/Q2C829MB