BDBM50340420 (S)-4-(3-(((3R,4S)-N-cyclopropyl-4-(4-(2-(2,6-dichloro-4-methylphenoxy)ethoxy)phenyl)piperidine-3-carboxamido)methyl)-5-(3-methoxypropyl)phenoxy)-2-methoxy-2-methylbutanoic acid::CHEMBL1761536
SMILES: COCCCc1cc(CN(C2CC2)C(=O)[C@H]2CNCC[C@@H]2c2ccc(OCCOc3c(Cl)cc(C)cc3Cl)cc2)cc(OCC[C@](C)(OC)C(O)=O)c1
InChI Key: InChIKey=QAIDCNOXZMESAW-JMUKJWEXSA-N
Data: 1 KI  4 IC50
Activity Spreadsheet -- Enzyme Inhibition Constant Data from BindingDB
Found 5 hits for monomerid = 50340420
Trg + Lig
Ki
nM
ΔG°
kcal/mole
IC50
nM
Kd
nM
EC50/IC50
nM
koff
s-1
kon
M-1s-1
pHTemp
°C
Potassium voltage-gated channel subfamily H member 2
(Homo sapiens (Human))
BDBM50340420
((S)-4-(3-(((3R,4S)-N-cyclopropyl-4-(4-(2-(2,6-dich...)
Show SMILES COCCCc1cc(CN(C2CC2)C(=O)[C@H]2CNCC[C@@H]2c2ccc(OCCOc3c(Cl)cc(C)cc3Cl)cc2)cc(OCC[C@](C)(OC)C(O)=O)c1 |r|
Show InChI InChI=1S/C41H52Cl2N2O8/c1-27-20-36(42)38(37(43)21-27)53-19-18-52-32-11-7-30(8-12-32)34-13-15-44-25-35(34)39(46)45(31-9-10-31)26-29-22-28(6-5-16-49-3)23-33(24-29)51-17-14-41(2,50-4)40(47)48/h7-8,11-12,20-24,31,34-35,44H,5-6,9-10,13-19,25-26H2,1-4H3,(H,47,48)/t34-,35+,41+/m1/s1
Reactome pathway
2.30E+3n/an/an/an/an/an/an/an/a
Merck Frosst Centre for Therapeutic Research
Curated by ChEMBL
Assay Description
Binding affinity to human ERG
Bioorg Med Chem Lett 21: 2430-6 (2011)
Article DOI: 10.1016/j.bmcl.2011.02.067
BindingDB Entry DOI: 10.7270/Q2G16157
Renin
(Homo sapiens (Human))
BDBM50340420
((S)-4-(3-(((3R,4S)-N-cyclopropyl-4-(4-(2-(2,6-dich...)
Show SMILES COCCCc1cc(CN(C2CC2)C(=O)[C@H]2CNCC[C@@H]2c2ccc(OCCOc3c(Cl)cc(C)cc3Cl)cc2)cc(OCC[C@](C)(OC)C(O)=O)c1 |r|
Show InChI InChI=1S/C41H52Cl2N2O8/c1-27-20-36(42)38(37(43)21-27)53-19-18-52-32-11-7-30(8-12-32)34-13-15-44-25-35(34)39(46)45(31-9-10-31)26-29-22-28(6-5-16-49-3)23-33(24-29)51-17-14-41(2,50-4)40(47)48/h7-8,11-12,20-24,31,34-35,44H,5-6,9-10,13-19,25-26H2,1-4H3,(H,47,48)/t34-,35+,41+/m1/s1
Reactome pathway
n/an/a 2.10n/an/an/an/an/an/a
Merck Frosst Centre for Therapeutic Research
Curated by ChEMBL
Assay Description
Inhibition of human recombinant renin in human citrated-plasma
Bioorg Med Chem Lett 21: 2430-6 (2011)
Article DOI: 10.1016/j.bmcl.2011.02.067
BindingDB Entry DOI: 10.7270/Q2G16157
Cytochrome P450 3A4
(Homo sapiens (Human))
BDBM50340420
((S)-4-(3-(((3R,4S)-N-cyclopropyl-4-(4-(2-(2,6-dich...)
Show SMILES COCCCc1cc(CN(C2CC2)C(=O)[C@H]2CNCC[C@@H]2c2ccc(OCCOc3c(Cl)cc(C)cc3Cl)cc2)cc(OCC[C@](C)(OC)C(O)=O)c1 |r|
Show InChI InChI=1S/C41H52Cl2N2O8/c1-27-20-36(42)38(37(43)21-27)53-19-18-52-32-11-7-30(8-12-32)34-13-15-44-25-35(34)39(46)45(31-9-10-31)26-29-22-28(6-5-16-49-3)23-33(24-29)51-17-14-41(2,50-4)40(47)48/h7-8,11-12,20-24,31,34-35,44H,5-6,9-10,13-19,25-26H2,1-4H3,(H,47,48)/t34-,35+,41+/m1/s1
Reactome pathway
n/an/a>5.00E+4n/an/an/an/an/an/a
Merck Frosst Centre for Therapeutic Research
Curated by ChEMBL
Assay Description
Inhibition of human CYP3A4 in human liver microsomes assessed as formation of 6beta-hydroxy-testosterone using testosterone as substrate by high thro...
Bioorg Med Chem Lett 21: 2430-6 (2011)
Article DOI: 10.1016/j.bmcl.2011.02.067
BindingDB Entry DOI: 10.7270/Q2G16157
Cytochrome P450 3A4
(Homo sapiens (Human))
BDBM50340420
((S)-4-(3-(((3R,4S)-N-cyclopropyl-4-(4-(2-(2,6-dich...)
Show SMILES COCCCc1cc(CN(C2CC2)C(=O)[C@H]2CNCC[C@@H]2c2ccc(OCCOc3c(Cl)cc(C)cc3Cl)cc2)cc(OCC[C@](C)(OC)C(O)=O)c1 |r|
Show InChI InChI=1S/C41H52Cl2N2O8/c1-27-20-36(42)38(37(43)21-27)53-19-18-52-32-11-7-30(8-12-32)34-13-15-44-25-35(34)39(46)45(31-9-10-31)26-29-22-28(6-5-16-49-3)23-33(24-29)51-17-14-41(2,50-4)40(47)48/h7-8,11-12,20-24,31,34-35,44H,5-6,9-10,13-19,25-26H2,1-4H3,(H,47,48)/t34-,35+,41+/m1/s1
Reactome pathway
n/an/a>5.00E+4n/an/an/an/an/an/a
Merck Frosst Centre for Therapeutic Research
Curated by ChEMBL
Assay Description
Inhibition of human CYP3A4 in human liver microsomes assessed as formation of 6beta-hydroxy-testosterone using testosterone as substrate by high thro...
Bioorg Med Chem Lett 21: 2430-6 (2011)
Article DOI: 10.1016/j.bmcl.2011.02.067
BindingDB Entry DOI: 10.7270/Q2G16157
Renin
(Homo sapiens (Human))
BDBM50340420
((S)-4-(3-(((3R,4S)-N-cyclopropyl-4-(4-(2-(2,6-dich...)
Show SMILES COCCCc1cc(CN(C2CC2)C(=O)[C@H]2CNCC[C@@H]2c2ccc(OCCOc3c(Cl)cc(C)cc3Cl)cc2)cc(OCC[C@](C)(OC)C(O)=O)c1 |r|
Show InChI InChI=1S/C41H52Cl2N2O8/c1-27-20-36(42)38(37(43)21-27)53-19-18-52-32-11-7-30(8-12-32)34-13-15-44-25-35(34)39(46)45(31-9-10-31)26-29-22-28(6-5-16-49-3)23-33(24-29)51-17-14-41(2,50-4)40(47)48/h7-8,11-12,20-24,31,34-35,44H,5-6,9-10,13-19,25-26H2,1-4H3,(H,47,48)/t34-,35+,41+/m1/s1
Reactome pathway
n/an/a 0.0600n/an/an/an/a7.4n/a
Merck Frosst Centre for Therapeutic Research
Curated by ChEMBL
Assay Description
Inhibition of human recombinant renin in PBS buffer using tetradecapeptide at pH 7.4
Bioorg Med Chem Lett 21: 2430-6 (2011)
Article DOI: 10.1016/j.bmcl.2011.02.067
BindingDB Entry DOI: 10.7270/Q2G16157