BDBM50340482 (1S,3aS,3bS,8bS,8cS,10aS)-N-tert-butyl-8b,10a-dimethyl-7-oxo-1,2,3,3a,3b,4,5,7,7a,8,8a,8b,8c,9,10,10a-hexadecahydrocyclopenta[i]cyclopropa[a]phenanthridine-1-carboxamide::CHEMBL1762038
SMILES: CC(C)(C)NC(=O)[C@H]1CC[C@H]2[C@@H]3CN=C4CC(=O)C5CC5[C@]4(C)[C@H]3CC[C@]12C
InChI Key: InChIKey=DEAVUWHJOWDMKM-RBEKHYMNSA-N
Data: 1 IC50
Activity Spreadsheet -- Enzyme Inhibition Constant Data from BindingDB
Found 1 hit for monomerid = 50340482
Trg + Lig
Ki
nM
ΔG°
kcal/mole
IC50
nM
Kd
nM
EC50/IC50
nM
koff
s-1
kon
M-1s-1
pHTemp
°C
3 beta-hydroxysteroid dehydrogenase/Delta 5-->4-isomerase
(Mycobacterium tuberculosis)
BDBM50340482
((1S,3aS,3bS,8bS,8cS,10aS)-N-tert-butyl-8b,10a-dime...)
Show SMILES CC(C)(C)NC(=O)[C@H]1CC[C@H]2[C@@H]3CN=C4CC(=O)C5CC5[C@]4(C)[C@H]3CC[C@]12C |r,t:13|
Show InChI InChI=1S/C24H36N2O2/c1-22(2,3)26-21(28)17-7-6-15-14-12-25-20-11-19(27)13-10-18(13)24(20,5)16(14)8-9-23(15,17)4/h13-18H,6-12H2,1-5H3,(H,26,28)/t13?,14-,15-,16-,17+,18?,23-,24-/m0/s1
n/an/a>2.00E+5n/an/an/an/an/an/a
Stony Brook University
Curated by ChEMBL
Assay Description
Inhibition of Mycobacterium tuberculosis 3 beta hydroxysteriod dehydrogenase
Bioorg Med Chem Lett 21: 2216-9 (2011)
Article DOI: 10.1016/j.bmcl.2011.03.004
BindingDB Entry DOI: 10.7270/Q2Z31ZXD