BDBM50340553 (3-((2-(3,5-dimorpholinophenylamino)pyrimidin-4-yl)(isopropyl)amino)-4-methylphenyl)methanol::CHEMBL1762548
SMILES: CC(C)N(c1ccnc(Nc2cc(cc(c2)N2CCOCC2)N2CCOCC2)n1)c1cc(CO)ccc1C
InChI Key: InChIKey=IIKUCLMTVMIFPY-UHFFFAOYSA-N
Data: 2 IC50
Activity Spreadsheet -- Enzyme Inhibition Constant Data from BindingDB
Found 2 hits for monomerid = 50340553
Trg + Lig
Ki
nM
ΔG°
kcal/mole
IC50
nM
Kd
nM
EC50/IC50
nM
koff
s-1
kon
M-1s-1
pHTemp
°C
Ephrin type-B receptor 4
(Homo sapiens (Human))
BDBM50340553
((3-((2-(3,5-dimorpholinophenylamino)pyrimidin-4-yl...)
Show SMILES CC(C)N(c1ccnc(Nc2cc(cc(c2)N2CCOCC2)N2CCOCC2)n1)c1cc(CO)ccc1C
Show InChI InChI=1S/C29H38N6O3/c1-21(2)35(27-16-23(20-36)5-4-22(27)3)28-6-7-30-29(32-28)31-24-17-25(33-8-12-37-13-9-33)19-26(18-24)34-10-14-38-15-11-34/h4-7,16-19,21,36H,8-15,20H2,1-3H3,(H,30,31,32)
Reactome pathway
n/an/a 5n/an/an/an/an/an/a
Centre de Recherches
Curated by ChEMBL
Assay Description
Inhibition of human EPHB4
Bioorg Med Chem Lett 21: 2207-11 (2011)
Article DOI: 10.1016/j.bmcl.2011.03.009
BindingDB Entry DOI: 10.7270/Q2PK0GGR
Ephrin type-B receptor 4
(Homo sapiens (Human))
BDBM50340553
((3-((2-(3,5-dimorpholinophenylamino)pyrimidin-4-yl...)
Show SMILES CC(C)N(c1ccnc(Nc2cc(cc(c2)N2CCOCC2)N2CCOCC2)n1)c1cc(CO)ccc1C
Show InChI InChI=1S/C29H38N6O3/c1-21(2)35(27-16-23(20-36)5-4-22(27)3)28-6-7-30-29(32-28)31-24-17-25(33-8-12-37-13-9-33)19-26(18-24)34-10-14-38-15-11-34/h4-7,16-19,21,36H,8-15,20H2,1-3H3,(H,30,31,32)
Reactome pathway
n/an/a 13n/an/an/an/an/an/a
Centre de Recherches
Curated by ChEMBL
Assay Description
Inhibition of human EphB4 autophosphorylation expressed in CHOK1 cells
Bioorg Med Chem Lett 21: 2207-11 (2011)
Article DOI: 10.1016/j.bmcl.2011.03.009
BindingDB Entry DOI: 10.7270/Q2PK0GGR