BDBM50340554 (3-((2-(3,5-dimorpholinophenylamino)pyrimidin-4-yl)(ethyl)amino)-4-methylphenyl)methanol::CHEMBL1762547
SMILES: CCN(c1ccnc(Nc2cc(cc(c2)N2CCOCC2)N2CCOCC2)n1)c1cc(CO)ccc1C
InChI Key: InChIKey=KKSHELMUSUNFMM-UHFFFAOYSA-N
Data: 2 IC50
Activity Spreadsheet -- Enzyme Inhibition Constant Data from BindingDB
Found 2 hits for monomerid = 50340554
Trg + Lig
Ki
nM
ΔG°
kcal/mole
IC50
nM
Kd
nM
EC50/IC50
nM
koff
s-1
kon
M-1s-1
pHTemp
°C
Ephrin type-B receptor 4
(Homo sapiens (Human))
BDBM50340554
((3-((2-(3,5-dimorpholinophenylamino)pyrimidin-4-yl...)
Show SMILES CCN(c1ccnc(Nc2cc(cc(c2)N2CCOCC2)N2CCOCC2)n1)c1cc(CO)ccc1C
Show InChI InChI=1S/C28H36N6O3/c1-3-34(26-16-22(20-35)5-4-21(26)2)27-6-7-29-28(31-27)30-23-17-24(32-8-12-36-13-9-32)19-25(18-23)33-10-14-37-15-11-33/h4-7,16-19,35H,3,8-15,20H2,1-2H3,(H,29,30,31)
Reactome pathway
n/an/a 4n/an/an/an/an/an/a
Centre de Recherches
Curated by ChEMBL
Assay Description
Inhibition of human EPHB4
Bioorg Med Chem Lett 21: 2207-11 (2011)
Article DOI: 10.1016/j.bmcl.2011.03.009
BindingDB Entry DOI: 10.7270/Q2PK0GGR
Ephrin type-B receptor 4
(Homo sapiens (Human))
BDBM50340554
((3-((2-(3,5-dimorpholinophenylamino)pyrimidin-4-yl...)
Show SMILES CCN(c1ccnc(Nc2cc(cc(c2)N2CCOCC2)N2CCOCC2)n1)c1cc(CO)ccc1C
Show InChI InChI=1S/C28H36N6O3/c1-3-34(26-16-22(20-35)5-4-21(26)2)27-6-7-29-28(31-27)30-23-17-24(32-8-12-36-13-9-32)19-25(18-23)33-10-14-37-15-11-33/h4-7,16-19,35H,3,8-15,20H2,1-2H3,(H,29,30,31)
Reactome pathway
n/an/a 14n/an/an/an/an/an/a
Centre de Recherches
Curated by ChEMBL
Assay Description
Inhibition of human EphB4 autophosphorylation expressed in CHOK1 cells
Bioorg Med Chem Lett 21: 2207-11 (2011)
Article DOI: 10.1016/j.bmcl.2011.03.009
BindingDB Entry DOI: 10.7270/Q2PK0GGR