BDBM50340558 (4-methyl-3-(methyl(2-(3-morpholino-5-(tetrahydro-2H-pyran-4-yloxy)phenylamino)pyrimidin-4-yl)amino)phenyl)methanol::CHEMBL1762543
SMILES: CN(c1ccnc(Nc2cc(OC3CCOCC3)cc(c2)N2CCOCC2)n1)c1cc(CO)ccc1C
InChI Key: InChIKey=JZUWYLAIKXLYOR-UHFFFAOYSA-N
Data: 2 IC50
Activity Spreadsheet -- Enzyme Inhibition Constant Data from BindingDB
Found 2 hits for monomerid = 50340558
Trg + Lig
Ki
nM
ΔG°
kcal/mole
IC50
nM
Kd
nM
EC50/IC50
nM
koff
s-1
kon
M-1s-1
pHTemp
°C
Ephrin type-B receptor 4
(Homo sapiens (Human))
BDBM50340558
((4-methyl-3-(methyl(2-(3-morpholino-5-(tetrahydro-...)
Show SMILES CN(c1ccnc(Nc2cc(OC3CCOCC3)cc(c2)N2CCOCC2)n1)c1cc(CO)ccc1C
Show InChI InChI=1S/C28H35N5O4/c1-20-3-4-21(19-34)15-26(20)32(2)27-5-8-29-28(31-27)30-22-16-23(33-9-13-36-14-10-33)18-25(17-22)37-24-6-11-35-12-7-24/h3-5,8,15-18,24,34H,6-7,9-14,19H2,1-2H3,(H,29,30,31)
Reactome pathway
n/an/a 8n/an/an/an/an/an/a
Centre de Recherches
Curated by ChEMBL
Assay Description
Inhibition of human EPHB4
Bioorg Med Chem Lett 21: 2207-11 (2011)
Article DOI: 10.1016/j.bmcl.2011.03.009
BindingDB Entry DOI: 10.7270/Q2PK0GGR
Ephrin type-B receptor 4
(Homo sapiens (Human))
BDBM50340558
((4-methyl-3-(methyl(2-(3-morpholino-5-(tetrahydro-...)
Show SMILES CN(c1ccnc(Nc2cc(OC3CCOCC3)cc(c2)N2CCOCC2)n1)c1cc(CO)ccc1C
Show InChI InChI=1S/C28H35N5O4/c1-20-3-4-21(19-34)15-26(20)32(2)27-5-8-29-28(31-27)30-22-16-23(33-9-13-36-14-10-33)18-25(17-22)37-24-6-11-35-12-7-24/h3-5,8,15-18,24,34H,6-7,9-14,19H2,1-2H3,(H,29,30,31)
Reactome pathway
n/an/a 23n/an/an/an/an/an/a
Centre de Recherches
Curated by ChEMBL
Assay Description
Inhibition of human EphB4 autophosphorylation expressed in CHOK1 cells
Bioorg Med Chem Lett 21: 2207-11 (2011)
Article DOI: 10.1016/j.bmcl.2011.03.009
BindingDB Entry DOI: 10.7270/Q2PK0GGR