BDBM50340567 CHEMBL1762534::N2-(3,5-dimorpholinophenyl)-N4-(6-methoxypyridin-2-yl)-N4-methylpyrimidine-2,4-diamine
SMILES: COc1cccc(n1)N(C)c1ccnc(Nc2cc(cc(c2)N2CCOCC2)N2CCOCC2)n1
InChI Key: InChIKey=FWWFUGDJLTVEBU-UHFFFAOYSA-N
Data: 4 IC50
Activity Spreadsheet -- Enzyme Inhibition Constant Data from BindingDB
Found 4 hits for monomerid = 50340567
Trg + Lig
Ki
nM
ΔG°
kcal/mole
IC50
nM
Kd
nM
EC50/IC50
nM
koff
s-1
kon
M-1s-1
pHTemp
°C
Ephrin type-B receptor 4
(Homo sapiens (Human))
BDBM50340567
(CHEMBL1762534 | N2-(3,5-dimorpholinophenyl)-N4-(6-...)
Show SMILES COc1cccc(n1)N(C)c1ccnc(Nc2cc(cc(c2)N2CCOCC2)N2CCOCC2)n1
Show InChI InChI=1S/C25H31N7O3/c1-30(22-4-3-5-24(28-22)33-2)23-6-7-26-25(29-23)27-19-16-20(31-8-12-34-13-9-31)18-21(17-19)32-10-14-35-15-11-32/h3-7,16-18H,8-15H2,1-2H3,(H,26,27,29)
Reactome pathway
n/an/a 28n/an/an/an/an/an/a
Centre de Recherches
Curated by ChEMBL
Assay Description
Inhibition of human EphB4 autophosphorylation expressed in CHOK1 cells
Bioorg Med Chem Lett 21: 2207-11 (2011)
Article DOI: 10.1016/j.bmcl.2011.03.009
BindingDB Entry DOI: 10.7270/Q2PK0GGR
Fibroblast growth factor receptor 1
(Homo sapiens (Human))
BDBM50340567
(CHEMBL1762534 | N2-(3,5-dimorpholinophenyl)-N4-(6-...)
Show SMILES COc1cccc(n1)N(C)c1ccnc(Nc2cc(cc(c2)N2CCOCC2)N2CCOCC2)n1
Show InChI InChI=1S/C25H31N7O3/c1-30(22-4-3-5-24(28-22)33-2)23-6-7-26-25(29-23)27-19-16-20(31-8-12-34-13-9-31)18-21(17-19)32-10-14-35-15-11-32/h3-7,16-18H,8-15H2,1-2H3,(H,26,27,29)
NCI pathway
Reactome pathway
n/an/a 998n/an/an/an/an/an/a
Centre de Recherches
Curated by ChEMBL
Assay Description
Inhibition FGFR1
Bioorg Med Chem Lett 21: 2207-11 (2011)
Article DOI: 10.1016/j.bmcl.2011.03.009
BindingDB Entry DOI: 10.7270/Q2PK0GGR
Ephrin type-B receptor 4
(Homo sapiens (Human))
BDBM50340567
(CHEMBL1762534 | N2-(3,5-dimorpholinophenyl)-N4-(6-...)
Show SMILES COc1cccc(n1)N(C)c1ccnc(Nc2cc(cc(c2)N2CCOCC2)N2CCOCC2)n1
Show InChI InChI=1S/C25H31N7O3/c1-30(22-4-3-5-24(28-22)33-2)23-6-7-26-25(29-23)27-19-16-20(31-8-12-34-13-9-31)18-21(17-19)32-10-14-35-15-11-32/h3-7,16-18H,8-15H2,1-2H3,(H,26,27,29)
Reactome pathway
n/an/a 6n/an/an/an/an/an/a
Centre de Recherches
Curated by ChEMBL
Assay Description
Inhibition of human EPHB4
Bioorg Med Chem Lett 21: 2207-11 (2011)
Article DOI: 10.1016/j.bmcl.2011.03.009
BindingDB Entry DOI: 10.7270/Q2PK0GGR
Vascular endothelial growth factor receptor 2
(Homo sapiens (Human))
BDBM50340567
(CHEMBL1762534 | N2-(3,5-dimorpholinophenyl)-N4-(6-...)
Show SMILES COc1cccc(n1)N(C)c1ccnc(Nc2cc(cc(c2)N2CCOCC2)N2CCOCC2)n1
Show InChI InChI=1S/C25H31N7O3/c1-30(22-4-3-5-24(28-22)33-2)23-6-7-26-25(29-23)27-19-16-20(31-8-12-34-13-9-31)18-21(17-19)32-10-14-35-15-11-32/h3-7,16-18H,8-15H2,1-2H3,(H,26,27,29)
NCI pathway
Reactome pathway
n/an/a 989n/an/an/an/an/an/a
Centre de Recherches
Curated by ChEMBL
Assay Description
Inhibition of VEGFR2
Bioorg Med Chem Lett 21: 2207-11 (2011)
Article DOI: 10.1016/j.bmcl.2011.03.009
BindingDB Entry DOI: 10.7270/Q2PK0GGR