BDBM50340660 CHEMBL1762210::rac-5,7-difluoro-3-hydroxy-2,2-dimethyl-6-(3-methyl-1H-indol-7-yl)-2,3-dihydroquinolin-4(1H)-one O-ethyl oxime
SMILES: CCO\N=C1/C(O)C(C)(C)Nc2cc(F)c(c(F)c12)-c1cccc2c(C)c[nH]c12
InChI Key: InChIKey=NMIXBOUDRDWICA-OOAXWGSJSA-N
Data: 4 KI  2 IC50  2 EC50
Activity Spreadsheet -- Enzyme Inhibition Constant Data from BindingDB
Found 8 hits for monomerid = 50340660
Trg + Lig
Ki
nM
ΔG°
kcal/mole
IC50
nM
Kd
nM
EC50/IC50
nM
koff
s-1
kon
M-1s-1
pHTemp
°C
Glucocorticoid receptor
(Homo sapiens (Human))
BDBM50340660
(CHEMBL1762210 | rac-5,7-difluoro-3-hydroxy-2,2-dim...)
Show SMILES CCO\N=C1/C(O)C(C)(C)Nc2cc(F)c(c(F)c12)-c1cccc2c(C)c[nH]c12 |(18.93,7.26,;17.6,6.5,;17.59,4.96,;16.25,4.2,;16.24,2.67,;17.57,1.88,;18.91,2.64,;17.56,.34,;18.88,1.12,;18.88,-.43,;16.22,-.42,;14.9,.36,;13.57,-.4,;12.25,.37,;10.91,-.39,;12.25,1.91,;13.58,2.68,;13.58,4.21,;14.91,1.9,;10.93,2.69,;10.93,4.23,;9.59,5.01,;8.26,4.23,;8.25,2.69,;7.1,1.66,;5.77,2.43,;7.73,.25,;9.27,.41,;9.59,1.92,)|
Show InChI InChI=1S/C22H23F2N3O2/c1-5-29-27-20-17-15(26-22(3,4)21(20)28)9-14(23)16(18(17)24)13-8-6-7-12-11(2)10-25-19(12)13/h6-10,21,25-26,28H,5H2,1-4H3/b27-20-
0.600n/an/an/an/an/an/an/an/a
Ligand Pharmaceuticals
Curated by ChEMBL
Assay Description
Displacement of radiolabeled dexamethasone from glucocorticoid receptor expressed in baculovirus
Bioorg Med Chem Lett 21: 1654-7 (2011)
Article DOI: 10.1016/j.bmcl.2011.01.104
BindingDB Entry DOI: 10.7270/Q21V5F8D
Progesterone receptor
(Homo sapiens (Human))
BDBM50340660
(CHEMBL1762210 | rac-5,7-difluoro-3-hydroxy-2,2-dim...)
Show SMILES CCO\N=C1/C(O)C(C)(C)Nc2cc(F)c(c(F)c12)-c1cccc2c(C)c[nH]c12 |(18.93,7.26,;17.6,6.5,;17.59,4.96,;16.25,4.2,;16.24,2.67,;17.57,1.88,;18.91,2.64,;17.56,.34,;18.88,1.12,;18.88,-.43,;16.22,-.42,;14.9,.36,;13.57,-.4,;12.25,.37,;10.91,-.39,;12.25,1.91,;13.58,2.68,;13.58,4.21,;14.91,1.9,;10.93,2.69,;10.93,4.23,;9.59,5.01,;8.26,4.23,;8.25,2.69,;7.1,1.66,;5.77,2.43,;7.73,.25,;9.27,.41,;9.59,1.92,)|
Show InChI InChI=1S/C22H23F2N3O2/c1-5-29-27-20-17-15(26-22(3,4)21(20)28)9-14(23)16(18(17)24)13-8-6-7-12-11(2)10-25-19(12)13/h6-10,21,25-26,28H,5H2,1-4H3/b27-20-
27n/an/an/an/an/an/an/an/a
Ligand Pharmaceuticals
Curated by ChEMBL
Assay Description
Binding affinity to progesterone receptor
Bioorg Med Chem Lett 21: 1654-7 (2011)
Article DOI: 10.1016/j.bmcl.2011.01.104
BindingDB Entry DOI: 10.7270/Q21V5F8D
Androgen Receptor
(Homo sapiens (Human))
BDBM50340660
(CHEMBL1762210 | rac-5,7-difluoro-3-hydroxy-2,2-dim...)
Show SMILES CCO\N=C1/C(O)C(C)(C)Nc2cc(F)c(c(F)c12)-c1cccc2c(C)c[nH]c12 |(18.93,7.26,;17.6,6.5,;17.59,4.96,;16.25,4.2,;16.24,2.67,;17.57,1.88,;18.91,2.64,;17.56,.34,;18.88,1.12,;18.88,-.43,;16.22,-.42,;14.9,.36,;13.57,-.4,;12.25,.37,;10.91,-.39,;12.25,1.91,;13.58,2.68,;13.58,4.21,;14.91,1.9,;10.93,2.69,;10.93,4.23,;9.59,5.01,;8.26,4.23,;8.25,2.69,;7.1,1.66,;5.77,2.43,;7.73,.25,;9.27,.41,;9.59,1.92,)|
Show InChI InChI=1S/C22H23F2N3O2/c1-5-29-27-20-17-15(26-22(3,4)21(20)28)9-14(23)16(18(17)24)13-8-6-7-12-11(2)10-25-19(12)13/h6-10,21,25-26,28H,5H2,1-4H3/b27-20-
NCI pathway
Reactome pathway
430n/an/an/an/an/an/an/an/a
Ligand Pharmaceuticals
Curated by ChEMBL
Assay Description
Binding affinity to androgen receptor
Bioorg Med Chem Lett 21: 1654-7 (2011)
Article DOI: 10.1016/j.bmcl.2011.01.104
BindingDB Entry DOI: 10.7270/Q21V5F8D
Mineralocorticoid receptor
(Homo sapiens (Human))
BDBM50340660
(CHEMBL1762210 | rac-5,7-difluoro-3-hydroxy-2,2-dim...)
Show SMILES CCO\N=C1/C(O)C(C)(C)Nc2cc(F)c(c(F)c12)-c1cccc2c(C)c[nH]c12 |(18.93,7.26,;17.6,6.5,;17.59,4.96,;16.25,4.2,;16.24,2.67,;17.57,1.88,;18.91,2.64,;17.56,.34,;18.88,1.12,;18.88,-.43,;16.22,-.42,;14.9,.36,;13.57,-.4,;12.25,.37,;10.91,-.39,;12.25,1.91,;13.58,2.68,;13.58,4.21,;14.91,1.9,;10.93,2.69,;10.93,4.23,;9.59,5.01,;8.26,4.23,;8.25,2.69,;7.1,1.66,;5.77,2.43,;7.73,.25,;9.27,.41,;9.59,1.92,)|
Show InChI InChI=1S/C22H23F2N3O2/c1-5-29-27-20-17-15(26-22(3,4)21(20)28)9-14(23)16(18(17)24)13-8-6-7-12-11(2)10-25-19(12)13/h6-10,21,25-26,28H,5H2,1-4H3/b27-20-
>1.00E+4n/an/an/an/an/an/an/an/a
Ligand Pharmaceuticals
Curated by ChEMBL
Assay Description
Binding affinity to mineralocorticoid receptor
Bioorg Med Chem Lett 21: 1654-7 (2011)
Article DOI: 10.1016/j.bmcl.2011.01.104
BindingDB Entry DOI: 10.7270/Q21V5F8D
Glucocorticoid receptor
(Homo sapiens (Human))
BDBM50340660
(CHEMBL1762210 | rac-5,7-difluoro-3-hydroxy-2,2-dim...)
Show SMILES CCO\N=C1/C(O)C(C)(C)Nc2cc(F)c(c(F)c12)-c1cccc2c(C)c[nH]c12 |(18.93,7.26,;17.6,6.5,;17.59,4.96,;16.25,4.2,;16.24,2.67,;17.57,1.88,;18.91,2.64,;17.56,.34,;18.88,1.12,;18.88,-.43,;16.22,-.42,;14.9,.36,;13.57,-.4,;12.25,.37,;10.91,-.39,;12.25,1.91,;13.58,2.68,;13.58,4.21,;14.91,1.9,;10.93,2.69,;10.93,4.23,;9.59,5.01,;8.26,4.23,;8.25,2.69,;7.1,1.66,;5.77,2.43,;7.73,.25,;9.27,.41,;9.59,1.92,)|
Show InChI InChI=1S/C22H23F2N3O2/c1-5-29-27-20-17-15(26-22(3,4)21(20)28)9-14(23)16(18(17)24)13-8-6-7-12-11(2)10-25-19(12)13/h6-10,21,25-26,28H,5H2,1-4H3/b27-20-
n/an/an/an/a 115n/an/an/an/a
Ligand Pharmaceuticals
Curated by ChEMBL
Assay Description
Agonist activity at glucocorticoid receptor in human HepG2 cells co-transfected with PEPCK assessed as GRE activation by luciferase reporter gene ass...
Bioorg Med Chem Lett 21: 1654-7 (2011)
Article DOI: 10.1016/j.bmcl.2011.01.104
BindingDB Entry DOI: 10.7270/Q21V5F8D
Glucocorticoid receptor
(Homo sapiens (Human))
BDBM50340660
(CHEMBL1762210 | rac-5,7-difluoro-3-hydroxy-2,2-dim...)
Show SMILES CCO\N=C1/C(O)C(C)(C)Nc2cc(F)c(c(F)c12)-c1cccc2c(C)c[nH]c12 |(18.93,7.26,;17.6,6.5,;17.59,4.96,;16.25,4.2,;16.24,2.67,;17.57,1.88,;18.91,2.64,;17.56,.34,;18.88,1.12,;18.88,-.43,;16.22,-.42,;14.9,.36,;13.57,-.4,;12.25,.37,;10.91,-.39,;12.25,1.91,;13.58,2.68,;13.58,4.21,;14.91,1.9,;10.93,2.69,;10.93,4.23,;9.59,5.01,;8.26,4.23,;8.25,2.69,;7.1,1.66,;5.77,2.43,;7.73,.25,;9.27,.41,;9.59,1.92,)|
Show InChI InChI=1S/C22H23F2N3O2/c1-5-29-27-20-17-15(26-22(3,4)21(20)28)9-14(23)16(18(17)24)13-8-6-7-12-11(2)10-25-19(12)13/h6-10,21,25-26,28H,5H2,1-4H3/b27-20-
n/an/a 5.20n/an/an/an/an/an/a
Ligand Pharmaceuticals
Curated by ChEMBL
Assay Description
Transrepression activity at glucocorticoid receptor in human NHDF cells assessed as inhibition of IL-1beta-stimulated AP1 dependent IL-6 repression b...
Bioorg Med Chem Lett 21: 1654-7 (2011)
Article DOI: 10.1016/j.bmcl.2011.01.104
BindingDB Entry DOI: 10.7270/Q21V5F8D
Glucocorticoid receptor
(Homo sapiens (Human))
BDBM50340660
(CHEMBL1762210 | rac-5,7-difluoro-3-hydroxy-2,2-dim...)
Show SMILES CCO\N=C1/C(O)C(C)(C)Nc2cc(F)c(c(F)c12)-c1cccc2c(C)c[nH]c12 |(18.93,7.26,;17.6,6.5,;17.59,4.96,;16.25,4.2,;16.24,2.67,;17.57,1.88,;18.91,2.64,;17.56,.34,;18.88,1.12,;18.88,-.43,;16.22,-.42,;14.9,.36,;13.57,-.4,;12.25,.37,;10.91,-.39,;12.25,1.91,;13.58,2.68,;13.58,4.21,;14.91,1.9,;10.93,2.69,;10.93,4.23,;9.59,5.01,;8.26,4.23,;8.25,2.69,;7.1,1.66,;5.77,2.43,;7.73,.25,;9.27,.41,;9.59,1.92,)|
Show InChI InChI=1S/C22H23F2N3O2/c1-5-29-27-20-17-15(26-22(3,4)21(20)28)9-14(23)16(18(17)24)13-8-6-7-12-11(2)10-25-19(12)13/h6-10,21,25-26,28H,5H2,1-4H3/b27-20-
n/an/a 2.60n/an/an/an/an/an/a
Ligand Pharmaceuticals
Curated by ChEMBL
Assay Description
Transrepression activity at glucocorticoid receptor in human HepG2 cells assessed as inhibition of TNFalpha/IL1beta-stimulated NFkappaB-dependent E-s...
Bioorg Med Chem Lett 21: 1654-7 (2011)
Article DOI: 10.1016/j.bmcl.2011.01.104
BindingDB Entry DOI: 10.7270/Q21V5F8D
Glucocorticoid receptor
(Homo sapiens (Human))
BDBM50340660
(CHEMBL1762210 | rac-5,7-difluoro-3-hydroxy-2,2-dim...)
Show SMILES CCO\N=C1/C(O)C(C)(C)Nc2cc(F)c(c(F)c12)-c1cccc2c(C)c[nH]c12 |(18.93,7.26,;17.6,6.5,;17.59,4.96,;16.25,4.2,;16.24,2.67,;17.57,1.88,;18.91,2.64,;17.56,.34,;18.88,1.12,;18.88,-.43,;16.22,-.42,;14.9,.36,;13.57,-.4,;12.25,.37,;10.91,-.39,;12.25,1.91,;13.58,2.68,;13.58,4.21,;14.91,1.9,;10.93,2.69,;10.93,4.23,;9.59,5.01,;8.26,4.23,;8.25,2.69,;7.1,1.66,;5.77,2.43,;7.73,.25,;9.27,.41,;9.59,1.92,)|
Show InChI InChI=1S/C22H23F2N3O2/c1-5-29-27-20-17-15(26-22(3,4)21(20)28)9-14(23)16(18(17)24)13-8-6-7-12-11(2)10-25-19(12)13/h6-10,21,25-26,28H,5H2,1-4H3/b27-20-
n/an/an/an/a 1.5n/an/an/an/a
Ligand Pharmaceuticals
Curated by ChEMBL
Assay Description
Agonist activity at glucocorticoid receptor in human HepG2 cells co-transfected with GRE assessed as GRE activation by luciferase reporter gene assay
Bioorg Med Chem Lett 21: 1654-7 (2011)
Article DOI: 10.1016/j.bmcl.2011.01.104
BindingDB Entry DOI: 10.7270/Q21V5F8D