BDBM50340662 5,7-difluoro-2,2-dimethyl-6-(3-methyl-1H-indol-7-yl)-2,3-dihydroquinolin-4(1H)-one O-1-hydroxy-2-methylpropan-2-yl oxime::CHEMBL1762209
SMILES: Cc1c[nH]c2c(cccc12)-c1c(F)cc2NC(C)(C)C\C(=N/OC(C)(C)CO)c2c1F
InChI Key: InChIKey=SGSLRJUNARVKFS-RDRPBHBLSA-N
Data: 4 KI  2 IC50  2 EC50
Activity Spreadsheet -- Enzyme Inhibition Constant Data from BindingDB
Found 8 hits for monomerid = 50340662
Trg + Lig
Ki
nM
ΔG°
kcal/mole
IC50
nM
Kd
nM
EC50/IC50
nM
koff
s-1
kon
M-1s-1
pHTemp
°C
Glucocorticoid receptor
(Homo sapiens (Human))
BDBM50340662
(5,7-difluoro-2,2-dimethyl-6-(3-methyl-1H-indol-7-y...)
Show SMILES Cc1c[nH]c2c(cccc12)-c1c(F)cc2NC(C)(C)C\C(=N/OC(C)(C)CO)c2c1F |(21.47,-47.3,;22.8,-48.07,;23.43,-49.48,;24.97,-49.32,;25.29,-47.81,;26.63,-47.04,;26.63,-45.5,;25.29,-44.72,;23.96,-45.5,;23.95,-47.04,;27.95,-47.82,;27.95,-49.35,;26.61,-50.12,;29.27,-50.12,;30.6,-49.37,;31.92,-50.15,;33.26,-49.39,;34.58,-48.61,;34.58,-50.15,;33.28,-47.85,;31.94,-47.06,;31.95,-45.52,;33.29,-44.77,;33.3,-43.23,;31.97,-42.45,;33.29,-41.69,;34.63,-42.47,;35.96,-43.25,;30.61,-47.83,;29.28,-47.05,;29.28,-45.51,)|
Show InChI InChI=1S/C24H27F2N3O2/c1-13-11-27-22-14(13)7-6-8-15(22)19-16(25)9-17-20(21(19)26)18(10-23(2,3)28-17)29-31-24(4,5)12-30/h6-9,11,27-28,30H,10,12H2,1-5H3/b29-18+
0.800n/an/an/an/an/an/an/an/a
Ligand Pharmaceuticals
Curated by ChEMBL
Assay Description
Displacement of radiolabeled dexamethasone from glucocorticoid receptor expressed in baculovirus
Bioorg Med Chem Lett 21: 1654-7 (2011)
Article DOI: 10.1016/j.bmcl.2011.01.104
BindingDB Entry DOI: 10.7270/Q21V5F8D
Androgen Receptor
(Homo sapiens (Human))
BDBM50340662
(5,7-difluoro-2,2-dimethyl-6-(3-methyl-1H-indol-7-y...)
Show SMILES Cc1c[nH]c2c(cccc12)-c1c(F)cc2NC(C)(C)C\C(=N/OC(C)(C)CO)c2c1F |(21.47,-47.3,;22.8,-48.07,;23.43,-49.48,;24.97,-49.32,;25.29,-47.81,;26.63,-47.04,;26.63,-45.5,;25.29,-44.72,;23.96,-45.5,;23.95,-47.04,;27.95,-47.82,;27.95,-49.35,;26.61,-50.12,;29.27,-50.12,;30.6,-49.37,;31.92,-50.15,;33.26,-49.39,;34.58,-48.61,;34.58,-50.15,;33.28,-47.85,;31.94,-47.06,;31.95,-45.52,;33.29,-44.77,;33.3,-43.23,;31.97,-42.45,;33.29,-41.69,;34.63,-42.47,;35.96,-43.25,;30.61,-47.83,;29.28,-47.05,;29.28,-45.51,)|
Show InChI InChI=1S/C24H27F2N3O2/c1-13-11-27-22-14(13)7-6-8-15(22)19-16(25)9-17-20(21(19)26)18(10-23(2,3)28-17)29-31-24(4,5)12-30/h6-9,11,27-28,30H,10,12H2,1-5H3/b29-18+
NCI pathway
Reactome pathway
290n/an/an/an/an/an/an/an/a
Ligand Pharmaceuticals
Curated by ChEMBL
Assay Description
Binding affinity to androgen receptor
Bioorg Med Chem Lett 21: 1654-7 (2011)
Article DOI: 10.1016/j.bmcl.2011.01.104
BindingDB Entry DOI: 10.7270/Q21V5F8D
Progesterone receptor
(Homo sapiens (Human))
BDBM50340662
(5,7-difluoro-2,2-dimethyl-6-(3-methyl-1H-indol-7-y...)
Show SMILES Cc1c[nH]c2c(cccc12)-c1c(F)cc2NC(C)(C)C\C(=N/OC(C)(C)CO)c2c1F |(21.47,-47.3,;22.8,-48.07,;23.43,-49.48,;24.97,-49.32,;25.29,-47.81,;26.63,-47.04,;26.63,-45.5,;25.29,-44.72,;23.96,-45.5,;23.95,-47.04,;27.95,-47.82,;27.95,-49.35,;26.61,-50.12,;29.27,-50.12,;30.6,-49.37,;31.92,-50.15,;33.26,-49.39,;34.58,-48.61,;34.58,-50.15,;33.28,-47.85,;31.94,-47.06,;31.95,-45.52,;33.29,-44.77,;33.3,-43.23,;31.97,-42.45,;33.29,-41.69,;34.63,-42.47,;35.96,-43.25,;30.61,-47.83,;29.28,-47.05,;29.28,-45.51,)|
Show InChI InChI=1S/C24H27F2N3O2/c1-13-11-27-22-14(13)7-6-8-15(22)19-16(25)9-17-20(21(19)26)18(10-23(2,3)28-17)29-31-24(4,5)12-30/h6-9,11,27-28,30H,10,12H2,1-5H3/b29-18+
950n/an/an/an/an/an/an/an/a
Ligand Pharmaceuticals
Curated by ChEMBL
Assay Description
Binding affinity to progesterone receptor
Bioorg Med Chem Lett 21: 1654-7 (2011)
Article DOI: 10.1016/j.bmcl.2011.01.104
BindingDB Entry DOI: 10.7270/Q21V5F8D
Mineralocorticoid receptor
(Homo sapiens (Human))
BDBM50340662
(5,7-difluoro-2,2-dimethyl-6-(3-methyl-1H-indol-7-y...)
Show SMILES Cc1c[nH]c2c(cccc12)-c1c(F)cc2NC(C)(C)C\C(=N/OC(C)(C)CO)c2c1F |(21.47,-47.3,;22.8,-48.07,;23.43,-49.48,;24.97,-49.32,;25.29,-47.81,;26.63,-47.04,;26.63,-45.5,;25.29,-44.72,;23.96,-45.5,;23.95,-47.04,;27.95,-47.82,;27.95,-49.35,;26.61,-50.12,;29.27,-50.12,;30.6,-49.37,;31.92,-50.15,;33.26,-49.39,;34.58,-48.61,;34.58,-50.15,;33.28,-47.85,;31.94,-47.06,;31.95,-45.52,;33.29,-44.77,;33.3,-43.23,;31.97,-42.45,;33.29,-41.69,;34.63,-42.47,;35.96,-43.25,;30.61,-47.83,;29.28,-47.05,;29.28,-45.51,)|
Show InChI InChI=1S/C24H27F2N3O2/c1-13-11-27-22-14(13)7-6-8-15(22)19-16(25)9-17-20(21(19)26)18(10-23(2,3)28-17)29-31-24(4,5)12-30/h6-9,11,27-28,30H,10,12H2,1-5H3/b29-18+
2.70E+3n/an/an/an/an/an/an/an/a
Ligand Pharmaceuticals
Curated by ChEMBL
Assay Description
Binding affinity to mineralocorticoid receptor
Bioorg Med Chem Lett 21: 1654-7 (2011)
Article DOI: 10.1016/j.bmcl.2011.01.104
BindingDB Entry DOI: 10.7270/Q21V5F8D
Glucocorticoid receptor
(Homo sapiens (Human))
BDBM50340662
(5,7-difluoro-2,2-dimethyl-6-(3-methyl-1H-indol-7-y...)
Show SMILES Cc1c[nH]c2c(cccc12)-c1c(F)cc2NC(C)(C)C\C(=N/OC(C)(C)CO)c2c1F |(21.47,-47.3,;22.8,-48.07,;23.43,-49.48,;24.97,-49.32,;25.29,-47.81,;26.63,-47.04,;26.63,-45.5,;25.29,-44.72,;23.96,-45.5,;23.95,-47.04,;27.95,-47.82,;27.95,-49.35,;26.61,-50.12,;29.27,-50.12,;30.6,-49.37,;31.92,-50.15,;33.26,-49.39,;34.58,-48.61,;34.58,-50.15,;33.28,-47.85,;31.94,-47.06,;31.95,-45.52,;33.29,-44.77,;33.3,-43.23,;31.97,-42.45,;33.29,-41.69,;34.63,-42.47,;35.96,-43.25,;30.61,-47.83,;29.28,-47.05,;29.28,-45.51,)|
Show InChI InChI=1S/C24H27F2N3O2/c1-13-11-27-22-14(13)7-6-8-15(22)19-16(25)9-17-20(21(19)26)18(10-23(2,3)28-17)29-31-24(4,5)12-30/h6-9,11,27-28,30H,10,12H2,1-5H3/b29-18+
n/an/an/an/a 350n/an/an/an/a
Ligand Pharmaceuticals
Curated by ChEMBL
Assay Description
Agonist activity at glucocorticoid receptor in human HepG2 cells co-transfected with PEPCK assessed as GRE activation by luciferase reporter gene ass...
Bioorg Med Chem Lett 21: 1654-7 (2011)
Article DOI: 10.1016/j.bmcl.2011.01.104
BindingDB Entry DOI: 10.7270/Q21V5F8D
Glucocorticoid receptor
(Homo sapiens (Human))
BDBM50340662
(5,7-difluoro-2,2-dimethyl-6-(3-methyl-1H-indol-7-y...)
Show SMILES Cc1c[nH]c2c(cccc12)-c1c(F)cc2NC(C)(C)C\C(=N/OC(C)(C)CO)c2c1F |(21.47,-47.3,;22.8,-48.07,;23.43,-49.48,;24.97,-49.32,;25.29,-47.81,;26.63,-47.04,;26.63,-45.5,;25.29,-44.72,;23.96,-45.5,;23.95,-47.04,;27.95,-47.82,;27.95,-49.35,;26.61,-50.12,;29.27,-50.12,;30.6,-49.37,;31.92,-50.15,;33.26,-49.39,;34.58,-48.61,;34.58,-50.15,;33.28,-47.85,;31.94,-47.06,;31.95,-45.52,;33.29,-44.77,;33.3,-43.23,;31.97,-42.45,;33.29,-41.69,;34.63,-42.47,;35.96,-43.25,;30.61,-47.83,;29.28,-47.05,;29.28,-45.51,)|
Show InChI InChI=1S/C24H27F2N3O2/c1-13-11-27-22-14(13)7-6-8-15(22)19-16(25)9-17-20(21(19)26)18(10-23(2,3)28-17)29-31-24(4,5)12-30/h6-9,11,27-28,30H,10,12H2,1-5H3/b29-18+
n/an/a 65n/an/an/an/an/an/a
Ligand Pharmaceuticals
Curated by ChEMBL
Assay Description
Transrepression activity at glucocorticoid receptor in human NHDF cells assessed as inhibition of IL-1beta-stimulated AP1 dependent IL-6 repression b...
Bioorg Med Chem Lett 21: 1654-7 (2011)
Article DOI: 10.1016/j.bmcl.2011.01.104
BindingDB Entry DOI: 10.7270/Q21V5F8D
Glucocorticoid receptor
(Homo sapiens (Human))
BDBM50340662
(5,7-difluoro-2,2-dimethyl-6-(3-methyl-1H-indol-7-y...)
Show SMILES Cc1c[nH]c2c(cccc12)-c1c(F)cc2NC(C)(C)C\C(=N/OC(C)(C)CO)c2c1F |(21.47,-47.3,;22.8,-48.07,;23.43,-49.48,;24.97,-49.32,;25.29,-47.81,;26.63,-47.04,;26.63,-45.5,;25.29,-44.72,;23.96,-45.5,;23.95,-47.04,;27.95,-47.82,;27.95,-49.35,;26.61,-50.12,;29.27,-50.12,;30.6,-49.37,;31.92,-50.15,;33.26,-49.39,;34.58,-48.61,;34.58,-50.15,;33.28,-47.85,;31.94,-47.06,;31.95,-45.52,;33.29,-44.77,;33.3,-43.23,;31.97,-42.45,;33.29,-41.69,;34.63,-42.47,;35.96,-43.25,;30.61,-47.83,;29.28,-47.05,;29.28,-45.51,)|
Show InChI InChI=1S/C24H27F2N3O2/c1-13-11-27-22-14(13)7-6-8-15(22)19-16(25)9-17-20(21(19)26)18(10-23(2,3)28-17)29-31-24(4,5)12-30/h6-9,11,27-28,30H,10,12H2,1-5H3/b29-18+
n/an/a 12n/an/an/an/an/an/a
Ligand Pharmaceuticals
Curated by ChEMBL
Assay Description
Transrepression activity at glucocorticoid receptor in human HepG2 cells assessed as inhibition of TNFalpha/IL1beta-stimulated NFkappaB-dependent E-s...
Bioorg Med Chem Lett 21: 1654-7 (2011)
Article DOI: 10.1016/j.bmcl.2011.01.104
BindingDB Entry DOI: 10.7270/Q21V5F8D
Glucocorticoid receptor
(Homo sapiens (Human))
BDBM50340662
(5,7-difluoro-2,2-dimethyl-6-(3-methyl-1H-indol-7-y...)
Show SMILES Cc1c[nH]c2c(cccc12)-c1c(F)cc2NC(C)(C)C\C(=N/OC(C)(C)CO)c2c1F |(21.47,-47.3,;22.8,-48.07,;23.43,-49.48,;24.97,-49.32,;25.29,-47.81,;26.63,-47.04,;26.63,-45.5,;25.29,-44.72,;23.96,-45.5,;23.95,-47.04,;27.95,-47.82,;27.95,-49.35,;26.61,-50.12,;29.27,-50.12,;30.6,-49.37,;31.92,-50.15,;33.26,-49.39,;34.58,-48.61,;34.58,-50.15,;33.28,-47.85,;31.94,-47.06,;31.95,-45.52,;33.29,-44.77,;33.3,-43.23,;31.97,-42.45,;33.29,-41.69,;34.63,-42.47,;35.96,-43.25,;30.61,-47.83,;29.28,-47.05,;29.28,-45.51,)|
Show InChI InChI=1S/C24H27F2N3O2/c1-13-11-27-22-14(13)7-6-8-15(22)19-16(25)9-17-20(21(19)26)18(10-23(2,3)28-17)29-31-24(4,5)12-30/h6-9,11,27-28,30H,10,12H2,1-5H3/b29-18+
n/an/an/an/a 19n/an/an/an/a
Ligand Pharmaceuticals
Curated by ChEMBL
Assay Description
Agonist activity at glucocorticoid receptor in human HepG2 cells co-transfected with GRE assessed as GRE activation by luciferase reporter gene assay
Bioorg Med Chem Lett 21: 1654-7 (2011)
Article DOI: 10.1016/j.bmcl.2011.01.104
BindingDB Entry DOI: 10.7270/Q21V5F8D