BDBM50340683 CHEMBL1762412::N-(4-amino-2-methylquinolin-6-yl)-2-[(4-aminomethyl)phenoxymethyl]benzamide
SMILES: Cc1cc(N)c2cc(NC(=O)c3ccccc3COc3ccc(CN)cc3)ccc2n1
InChI Key: InChIKey=ZOCOINVGSJZJEQ-UHFFFAOYSA-N
Data: 1 IC50
Activity Spreadsheet -- Enzyme Inhibition Constant Data from BindingDB
Found 1 hit for monomerid = 50340683
Trg + Lig
Ki
nM
ΔG°
kcal/mole
IC50
nM
Kd
nM
EC50/IC50
nM
koff
s-1
kon
M-1s-1
pHTemp
°C
Nociceptin receptor
(Homo sapiens (Human))
BDBM50340683
(CHEMBL1762412 | N-(4-amino-2-methylquinolin-6-yl)-...)
Show SMILES Cc1cc(N)c2cc(NC(=O)c3ccccc3COc3ccc(CN)cc3)ccc2n1
Show InChI InChI=1S/C25H24N4O2/c1-16-12-23(27)22-13-19(8-11-24(22)28-16)29-25(30)21-5-3-2-4-18(21)15-31-20-9-6-17(14-26)7-10-20/h2-13H,14-15,26H2,1H3,(H2,27,28)(H,29,30)
Reactome pathway
n/an/a 116n/an/an/an/an/an/a
Istituto Superiore di Sanit£
Curated by ChEMBL
Assay Description
Displacement of [125I]Tyr14-nociceptin from human NOP receptor expressed in human HEK293 cells after 2 hrs by scintillation counting
Eur J Med Chem 46: 1207-21 (2011)
Article DOI: 10.1016/j.ejmech.2011.01.040
BindingDB Entry DOI: 10.7270/Q2NK3FBC