BDBM50340713 (E,E)-N,N'-bis[[4-[[2-[[(4-amino-2-methylquinolin-6-yl)amino]carbonyl]phenyl]methoxy]phenyl]methylene]-1,7-heptanediamine::CHEMBL1762377
SMILES: Cc1cc(N)c2cc(NC(=O)c3ccccc3COc3ccc(\C=N\CCCCCCC\N=C\c4ccc(OCc5ccccc5C(=O)Nc5ccc6nc(C)cc(N)c6c5)cc4)cc3)ccc2n1
InChI Key: InChIKey=VUWVNEJHRRCJDJ-YIMDWRJOSA-N
Data: 1 IC50
Activity Spreadsheet -- Enzyme Inhibition Constant Data from BindingDB
Found 1 hit for monomerid = 50340713
Trg + Lig
Ki
nM
ΔG°
kcal/mole
IC50
nM
Kd
nM
EC50/IC50
nM
koff
s-1
kon
M-1s-1
pHTemp
°C
Nociceptin receptor
(Homo sapiens (Human))
BDBM50340713
((E,E)-N,N'-bis[[4-[[2-[[(4-amino-2-methylquinolin-...)
Show SMILES Cc1cc(N)c2cc(NC(=O)c3ccccc3COc3ccc(\C=N\CCCCCCC\N=C\c4ccc(OCc5ccccc5C(=O)Nc5ccc6nc(C)cc(N)c6c5)cc4)cc3)ccc2n1
Show InChI InChI=1S/C57H56N8O4/c1-38-30-52(58)50-32-44(20-26-54(50)62-38)64-56(66)48-14-8-6-12-42(48)36-68-46-22-16-40(17-23-46)34-60-28-10-4-3-5-11-29-61-35-41-18-24-47(25-19-41)69-37-43-13-7-9-15-49(43)57(67)65-45-21-27-55-51(33-45)53(59)31-39(2)63-55/h6-9,12-27,30-35H,3-5,10-11,28-29,36-37H2,1-2H3,(H2,58,62)(H2,59,63)(H,64,66)(H,65,67)/b60-34+,61-35+
Reactome pathway
n/an/a 63.1n/an/an/an/an/an/a
Istituto Superiore di Sanit£
Curated by ChEMBL
Assay Description
Displacement of [125I]Tyr14-nociceptin from human NOP receptor expressed in human HEK293 cells after 2 hrs by scintillation counting
Eur J Med Chem 46: 1207-21 (2011)
Article DOI: 10.1016/j.ejmech.2011.01.040
BindingDB Entry DOI: 10.7270/Q2NK3FBC