null
SMILES: Clc1ccc(CCNc2nccc(n2)N2CCN(CC(=O)N(CC3CC3)Cc3ccncc3)CC2)cc1
InChI Key: InChIKey=MIGAYPGLYCKTFK-UHFFFAOYSA-N
Activity Spreadsheet -- Enzyme Inhibition Constant Data from BindingDB
Found 1 hit for monomerid = 50340749
Trg + Lig
Ki
nM
ΔG°
kcal/mole
IC50
nM
Kd
nM
EC50/IC50
nM
koff
s-1
kon
M-1s-1
pHTemp
°C
Mas-related G-protein coupled receptor member X1
(Homo sapiens (Human))
BDBM50340749
(2-(4-(2-(4-chlorophenethylamino)pyrimidin-4-yl)pip...)
Show SMILES Clc1ccc(CCNc2nccc(n2)N2CCN(CC(=O)N(CC3CC3)Cc3ccncc3)CC2)cc1
Show InChI InChI=1S/C28H34ClN7O/c29-25-5-3-22(4-6-25)9-13-31-28-32-14-10-26(33-28)35-17-15-34(16-18-35)21-27(37)36(19-23-1-2-23)20-24-7-11-30-12-8-24/h3-8,10-12,14,23H,1-2,9,13,15-21H2,(H,31,32,33)
n/an/a 295n/an/an/an/an/an/a
AstraZeneca R&D Montreal
Curated by ChEMBL
Assay Description
Antagonist activity at SNSR4 in human HEK293 cells by FLIPR assay
Bioorg Med Chem Lett 21: 2102-5 (2011)
Article DOI: 10.1016/j.bmcl.2011.01.138
BindingDB Entry DOI: 10.7270/Q2D21XW7