BDBM50341069 2-(4-(2-(3-hydroxyphenylamino)-1H-benzo[d]imidazol-1-yl)-1,3,5-triazin-2-ylamino)acetonitrile::CHEMBL1615182::[(4-{2-[(3-hydroxyphenyl)amino]-1H-benzimidazol-1-yl}-1,3,5-triazin-2-yl)amino]acetonitrile
SMILES: Oc1cccc(Nc2nc3ccccc3n2-c2ncnc(NCC#N)n2)c1
InChI Key: InChIKey=FEBJYEFFVIDUNF-UHFFFAOYSA-N
Data: 4 KI  13 IC50
PDB links: 1 PDB ID matches this monomer.
Activity Spreadsheet -- Enzyme Inhibition Constant Data from BindingDB
Found 17 hits for monomerid = 50341069
Trg + Lig
Ki
nM
ΔG°
kcal/mole
IC50
nM
Kd
nM
EC50/IC50
nM
koff
s-1
kon
M-1s-1
pHTemp
°C
Phosphatidylinositol 4,5-bisphosphate 3-kinase catalytic subunit delta isoform
(Homo sapiens (Human))
BDBM50341069
(2-(4-(2-(3-hydroxyphenylamino)-1H-benzo[d]imidazol...)
Show SMILES Oc1cccc(Nc2nc3ccccc3n2-c2ncnc(NCC#N)n2)c1
Show InChI InChI=1S/C18H14N8O/c19-8-9-20-16-21-11-22-17(25-16)26-15-7-2-1-6-14(15)24-18(26)23-12-4-3-5-13(27)10-12/h1-7,10-11,27H,9H2,(H,23,24)(H,20,21,22,25)
NCI pathway
Reactome pathway
52n/an/an/an/an/an/an/an/a
Amgen Inc.
Curated by ChEMBL
Assay Description
Inhibition of human N-terminal poly-His tagged-PI3Kdelta expressed in Sf9 baculovirus system co-expressing p85alpha after 20 mins by AlphaScreen assa...
J Med Chem 55: 5188-219 (2012)
Article DOI: 10.1021/jm300184s
BindingDB Entry DOI: 10.7270/Q23F4QSJ
Phosphatidylinositol 4,5-bisphosphate 3-kinase catalytic subunit gamma isoform
(Homo sapiens (Human))
BDBM50341069
(2-(4-(2-(3-hydroxyphenylamino)-1H-benzo[d]imidazol...)
Show SMILES Oc1cccc(Nc2nc3ccccc3n2-c2ncnc(NCC#N)n2)c1
Show InChI InChI=1S/C18H14N8O/c19-8-9-20-16-21-11-22-17(25-16)26-15-7-2-1-6-14(15)24-18(26)23-12-4-3-5-13(27)10-12/h1-7,10-11,27H,9H2,(H,23,24)(H,20,21,22,25)
NCI pathway
Reactome pathway
120n/an/an/an/an/an/an/an/a
Amgen Inc.
Curated by ChEMBL
Assay Description
Inhibition of human N-terminal poly-His tagged-PI3Kgamma expressed in Sf9 baculovirus system co-expressing p85alpha after 20 mins by AlphaScreen assa...
J Med Chem 55: 5188-219 (2012)
Article DOI: 10.1021/jm300184s
BindingDB Entry DOI: 10.7270/Q23F4QSJ
3D
3D Structure (crystal)
Phosphatidylinositol 4,5-bisphosphate 3-kinase catalytic subunit beta isoform
(Homo sapiens (Human))
BDBM50341069
(2-(4-(2-(3-hydroxyphenylamino)-1H-benzo[d]imidazol...)
Show SMILES Oc1cccc(Nc2nc3ccccc3n2-c2ncnc(NCC#N)n2)c1
Show InChI InChI=1S/C18H14N8O/c19-8-9-20-16-21-11-22-17(25-16)26-15-7-2-1-6-14(15)24-18(26)23-12-4-3-5-13(27)10-12/h1-7,10-11,27H,9H2,(H,23,24)(H,20,21,22,25)
NCI pathway
Reactome pathway
190n/an/an/an/an/an/an/an/a
Amgen Inc.
Curated by ChEMBL
Assay Description
Inhibition of human N-terminal poly-His tagged-PI3Kbeta expressed in Sf9 baculovirus system co-expressing p85alpha after 20 mins by AlphaScreen assay
J Med Chem 55: 5188-219 (2012)
Article DOI: 10.1021/jm300184s
BindingDB Entry DOI: 10.7270/Q23F4QSJ
Phosphatidylinositol 4,5-bisphosphate 3-kinase catalytic subunit alpha isoform
(Homo sapiens (Human))
BDBM50341069
(2-(4-(2-(3-hydroxyphenylamino)-1H-benzo[d]imidazol...)
Show SMILES Oc1cccc(Nc2nc3ccccc3n2-c2ncnc(NCC#N)n2)c1
Show InChI InChI=1S/C18H14N8O/c19-8-9-20-16-21-11-22-17(25-16)26-15-7-2-1-6-14(15)24-18(26)23-12-4-3-5-13(27)10-12/h1-7,10-11,27H,9H2,(H,23,24)(H,20,21,22,25)
NCI pathway
Reactome pathway
350n/an/an/an/an/an/an/an/a
Amgen Inc.
Curated by ChEMBL
Assay Description
Inhibition of human N-terminal poly-His tagged-PI3Kalpha expressed in Sf9 baculovirus system co-expressing p85alpha after 20 mins by AlphaScreen assa...
J Med Chem 55: 5188-219 (2012)
Article DOI: 10.1021/jm300184s
BindingDB Entry DOI: 10.7270/Q23F4QSJ
Phosphatidylinositol 4,5-bisphosphate 3-kinase catalytic subunit gamma isoform
(Homo sapiens (Human))
BDBM50341069
(2-(4-(2-(3-hydroxyphenylamino)-1H-benzo[d]imidazol...)
Show SMILES Oc1cccc(Nc2nc3ccccc3n2-c2ncnc(NCC#N)n2)c1
Show InChI InChI=1S/C18H14N8O/c19-8-9-20-16-21-11-22-17(25-16)26-15-7-2-1-6-14(15)24-18(26)23-12-4-3-5-13(27)10-12/h1-7,10-11,27H,9H2,(H,23,24)(H,20,21,22,25)
NCI pathway
Reactome pathway
n/an/a 100n/an/an/an/an/an/a
Amgen Inc
Curated by ChEMBL
Assay Description
Inhibition of PI3Kgamma
Bioorg Med Chem Lett 21: 2064-70 (2011)
Article DOI: 10.1016/j.bmcl.2011.02.007
BindingDB Entry DOI: 10.7270/Q2FT8MBW
3D
3D Structure (crystal)
RAF proto-oncogene serine/threonine-protein kinase
(Homo sapiens (Human))
BDBM50341069
(2-(4-(2-(3-hydroxyphenylamino)-1H-benzo[d]imidazol...)
Show SMILES Oc1cccc(Nc2nc3ccccc3n2-c2ncnc(NCC#N)n2)c1
Show InChI InChI=1S/C18H14N8O/c19-8-9-20-16-21-11-22-17(25-16)26-15-7-2-1-6-14(15)24-18(26)23-12-4-3-5-13(27)10-12/h1-7,10-11,27H,9H2,(H,23,24)(H,20,21,22,25)
NCI pathway
Reactome pathway
n/an/a 3.00E+3n/an/an/an/an/an/a
Amgen Inc
Curated by ChEMBL
Assay Description
Inhibition of c-Raf at 1 uM relative to control
Bioorg Med Chem Lett 21: 2064-70 (2011)
Article DOI: 10.1016/j.bmcl.2011.02.007
BindingDB Entry DOI: 10.7270/Q2FT8MBW
Vascular endothelial growth factor receptor 2
(Homo sapiens (Human))
BDBM50341069
(2-(4-(2-(3-hydroxyphenylamino)-1H-benzo[d]imidazol...)
Show SMILES Oc1cccc(Nc2nc3ccccc3n2-c2ncnc(NCC#N)n2)c1
Show InChI InChI=1S/C18H14N8O/c19-8-9-20-16-21-11-22-17(25-16)26-15-7-2-1-6-14(15)24-18(26)23-12-4-3-5-13(27)10-12/h1-7,10-11,27H,9H2,(H,23,24)(H,20,21,22,25)
NCI pathway
Reactome pathway
n/an/a 4.00E+4n/an/an/an/an/an/a
Amgen Inc
Curated by ChEMBL
Assay Description
Inhibition of KDR at 1 uM relative to control
Bioorg Med Chem Lett 21: 2064-70 (2011)
Article DOI: 10.1016/j.bmcl.2011.02.007
BindingDB Entry DOI: 10.7270/Q2FT8MBW
Casein kinase I isoform delta
(Homo sapiens (Human))
BDBM50341069
(2-(4-(2-(3-hydroxyphenylamino)-1H-benzo[d]imidazol...)
Show SMILES Oc1cccc(Nc2nc3ccccc3n2-c2ncnc(NCC#N)n2)c1
Show InChI InChI=1S/C18H14N8O/c19-8-9-20-16-21-11-22-17(25-16)26-15-7-2-1-6-14(15)24-18(26)23-12-4-3-5-13(27)10-12/h1-7,10-11,27H,9H2,(H,23,24)(H,20,21,22,25)
n/an/a 4.00E+4n/an/an/an/an/an/a
Amgen Inc
Curated by ChEMBL
Assay Description
Inhibition of CK1delta at 1 uM relative to control
Bioorg Med Chem Lett 21: 2064-70 (2011)
Article DOI: 10.1016/j.bmcl.2011.02.007
BindingDB Entry DOI: 10.7270/Q2FT8MBW
Casein kinase I isoform delta
(Homo sapiens (Human))
BDBM50341069
(2-(4-(2-(3-hydroxyphenylamino)-1H-benzo[d]imidazol...)
Show SMILES Oc1cccc(Nc2nc3ccccc3n2-c2ncnc(NCC#N)n2)c1
Show InChI InChI=1S/C18H14N8O/c19-8-9-20-16-21-11-22-17(25-16)26-15-7-2-1-6-14(15)24-18(26)23-12-4-3-5-13(27)10-12/h1-7,10-11,27H,9H2,(H,23,24)(H,20,21,22,25)
n/an/a 1.60E+4n/an/an/an/an/an/a
Amgen Inc
Curated by ChEMBL
Assay Description
Inhibition of DCAMKL3 at 1 uM relative to control
Bioorg Med Chem Lett 21: 2064-70 (2011)
Article DOI: 10.1016/j.bmcl.2011.02.007
BindingDB Entry DOI: 10.7270/Q2FT8MBW
TGF-beta receptor type II
(Homo sapiens (Human))
BDBM50341069
(2-(4-(2-(3-hydroxyphenylamino)-1H-benzo[d]imidazol...)
Show SMILES Oc1cccc(Nc2nc3ccccc3n2-c2ncnc(NCC#N)n2)c1
Show InChI InChI=1S/C18H14N8O/c19-8-9-20-16-21-11-22-17(25-16)26-15-7-2-1-6-14(15)24-18(26)23-12-4-3-5-13(27)10-12/h1-7,10-11,27H,9H2,(H,23,24)(H,20,21,22,25)
NCI pathway
Reactome pathway
n/an/a 2.00E+3n/an/an/an/an/an/a
Amgen Inc
Curated by ChEMBL
Assay Description
Inhibition of TGFR2 at 1 uM relative to control
Bioorg Med Chem Lett 21: 2064-70 (2011)
Article DOI: 10.1016/j.bmcl.2011.02.007
BindingDB Entry DOI: 10.7270/Q2FT8MBW
Serine/threonine-protein kinase mTOR
(Homo sapiens (Human))
BDBM50341069
(2-(4-(2-(3-hydroxyphenylamino)-1H-benzo[d]imidazol...)
Show SMILES Oc1cccc(Nc2nc3ccccc3n2-c2ncnc(NCC#N)n2)c1
Show InChI InChI=1S/C18H14N8O/c19-8-9-20-16-21-11-22-17(25-16)26-15-7-2-1-6-14(15)24-18(26)23-12-4-3-5-13(27)10-12/h1-7,10-11,27H,9H2,(H,23,24)(H,20,21,22,25)
NCI pathway
Reactome pathway
n/an/a 97n/an/an/an/an/an/a
Amgen Inc
Curated by ChEMBL
Assay Description
Inhibition of mTOR assessed as inhibition of phosphorylation of 4EBP1 by Lantha-Screen enzyme assay
Bioorg Med Chem Lett 21: 2064-70 (2011)
Article DOI: 10.1016/j.bmcl.2011.02.007
BindingDB Entry DOI: 10.7270/Q2FT8MBW
Serine/threonine-protein kinase mTOR
(Homo sapiens (Human))
BDBM50341069
(2-(4-(2-(3-hydroxyphenylamino)-1H-benzo[d]imidazol...)
Show SMILES Oc1cccc(Nc2nc3ccccc3n2-c2ncnc(NCC#N)n2)c1
Show InChI InChI=1S/C18H14N8O/c19-8-9-20-16-21-11-22-17(25-16)26-15-7-2-1-6-14(15)24-18(26)23-12-4-3-5-13(27)10-12/h1-7,10-11,27H,9H2,(H,23,24)(H,20,21,22,25)
NCI pathway
Reactome pathway
n/an/a 93n/an/an/an/an/an/a
Amgen Inc.
Curated by ChEMBL
Assay Description
Inhibition of recombinant GST-tagged mTOR-mediated 4EBP1 phosphorylation after 90 mins by FRET assay
J Med Chem 55: 5188-219 (2012)
Article DOI: 10.1021/jm300184s
BindingDB Entry DOI: 10.7270/Q23F4QSJ
Phosphatidylinositol 4,5-bisphosphate 3-kinase catalytic subunit delta isoform
(Homo sapiens (Human))
BDBM50341069
(2-(4-(2-(3-hydroxyphenylamino)-1H-benzo[d]imidazol...)
Show SMILES Oc1cccc(Nc2nc3ccccc3n2-c2ncnc(NCC#N)n2)c1
Show InChI InChI=1S/C18H14N8O/c19-8-9-20-16-21-11-22-17(25-16)26-15-7-2-1-6-14(15)24-18(26)23-12-4-3-5-13(27)10-12/h1-7,10-11,27H,9H2,(H,23,24)(H,20,21,22,25)
NCI pathway
Reactome pathway
n/an/a 240n/an/an/an/an/an/a
Amgen Inc
Curated by ChEMBL
Assay Description
Inhibition of PI3Kdelta
Bioorg Med Chem Lett 21: 2064-70 (2011)
Article DOI: 10.1016/j.bmcl.2011.02.007
BindingDB Entry DOI: 10.7270/Q2FT8MBW
Phosphatidylinositol 4,5-bisphosphate 3-kinase catalytic subunit beta isoform
(Homo sapiens (Human))
BDBM50341069
(2-(4-(2-(3-hydroxyphenylamino)-1H-benzo[d]imidazol...)
Show SMILES Oc1cccc(Nc2nc3ccccc3n2-c2ncnc(NCC#N)n2)c1
Show InChI InChI=1S/C18H14N8O/c19-8-9-20-16-21-11-22-17(25-16)26-15-7-2-1-6-14(15)24-18(26)23-12-4-3-5-13(27)10-12/h1-7,10-11,27H,9H2,(H,23,24)(H,20,21,22,25)
NCI pathway
Reactome pathway
n/an/a 380n/an/an/an/an/an/a
Amgen Inc
Curated by ChEMBL
Assay Description
Inhibition of PI3Kbeta
Bioorg Med Chem Lett 21: 2064-70 (2011)
Article DOI: 10.1016/j.bmcl.2011.02.007
BindingDB Entry DOI: 10.7270/Q2FT8MBW
Phosphatidylinositol 4,5-bisphosphate 3-kinase catalytic subunit alpha isoform
(Homo sapiens (Human))
BDBM50341069
(2-(4-(2-(3-hydroxyphenylamino)-1H-benzo[d]imidazol...)
Show SMILES Oc1cccc(Nc2nc3ccccc3n2-c2ncnc(NCC#N)n2)c1
Show InChI InChI=1S/C18H14N8O/c19-8-9-20-16-21-11-22-17(25-16)26-15-7-2-1-6-14(15)24-18(26)23-12-4-3-5-13(27)10-12/h1-7,10-11,27H,9H2,(H,23,24)(H,20,21,22,25)
NCI pathway
Reactome pathway
n/an/a 320n/an/an/an/an/an/a
Amgen Inc
Curated by ChEMBL
Assay Description
Inhibition of PI3Kalpha
Bioorg Med Chem Lett 21: 2064-70 (2011)
Article DOI: 10.1016/j.bmcl.2011.02.007
BindingDB Entry DOI: 10.7270/Q2FT8MBW
Serine/threonine-protein kinase mTOR
(Homo sapiens (Human))
BDBM50341069
(2-(4-(2-(3-hydroxyphenylamino)-1H-benzo[d]imidazol...)
Show SMILES Oc1cccc(Nc2nc3ccccc3n2-c2ncnc(NCC#N)n2)c1
Show InChI InChI=1S/C18H14N8O/c19-8-9-20-16-21-11-22-17(25-16)26-15-7-2-1-6-14(15)24-18(26)23-12-4-3-5-13(27)10-12/h1-7,10-11,27H,9H2,(H,23,24)(H,20,21,22,25)
NCI pathway
Reactome pathway
n/an/a 1.70E+3n/an/an/an/an/an/a
Amgen Inc
Curated by ChEMBL
Assay Description
Inhibition of mTOR in human U-87 cells assessed as inhibition of phosphorylation of 4EBP1 at T37/46
Bioorg Med Chem Lett 21: 2064-70 (2011)
Article DOI: 10.1016/j.bmcl.2011.02.007
BindingDB Entry DOI: 10.7270/Q2FT8MBW
Serine/threonine-protein kinase mTOR
(Homo sapiens (Human))
BDBM50341069
(2-(4-(2-(3-hydroxyphenylamino)-1H-benzo[d]imidazol...)
Show SMILES Oc1cccc(Nc2nc3ccccc3n2-c2ncnc(NCC#N)n2)c1
Show InChI InChI=1S/C18H14N8O/c19-8-9-20-16-21-11-22-17(25-16)26-15-7-2-1-6-14(15)24-18(26)23-12-4-3-5-13(27)10-12/h1-7,10-11,27H,9H2,(H,23,24)(H,20,21,22,25)
NCI pathway
Reactome pathway
n/an/a 700n/an/an/an/an/an/a
Amgen Inc
Curated by ChEMBL
Assay Description
Inhibition of mTOR in human U-87 cells assessed as inhibition of phosphorylation of AKT at S473
Bioorg Med Chem Lett 21: 2064-70 (2011)
Article DOI: 10.1016/j.bmcl.2011.02.007
BindingDB Entry DOI: 10.7270/Q2FT8MBW