BDBM50341136 CHEMBL1760548::N-p-Methoxy cinnamoyl serotonin
SMILES: COc1ccc(\C=C\C(=O)NCCc2c[nH]c3ccc(O)cc23)cc1
InChI Key: InChIKey=UXBDRKNYXUPWEL-RUDMXATFSA-N
Data: 2 IC50
Activity Spreadsheet -- Enzyme Inhibition Constant Data from BindingDB
Found 2 hits for monomerid = 50341136
Trg + Lig
Ki
nM
ΔG°
kcal/mole
IC50
nM
Kd
nM
EC50/IC50
nM
koff
s-1
kon
M-1s-1
pHTemp
°C
Alpha-glucosidase MAL62
(Saccharomyces cerevisiae)
BDBM50341136
(CHEMBL1760548 | N-p-Methoxy cinnamoyl serotonin)
Show SMILES COc1ccc(\C=C\C(=O)NCCc2c[nH]c3ccc(O)cc23)cc1
Show InChI InChI=1S/C20H20N2O3/c1-25-17-6-2-14(3-7-17)4-9-20(24)21-11-10-15-13-22-19-8-5-16(23)12-18(15)19/h2-9,12-13,22-23H,10-11H2,1H3,(H,21,24)/b9-4+
Reactome pathway
n/an/a>3.00E+5n/an/an/an/an/an/a
TBA
Assay Description
Inhibition of yeast alpha-glucosidase using p-nitrophenyl-alpha-D-glucopyranoside as substrate preincubated for 10 min before substrate addition and ...
Citation and Details
Article DOI: 10.1007/s00044-011-9699-9
BindingDB Entry DOI: 10.7270/Q2930X2H
Tyrosinase
(Agaricus bisporus (Common mushroom))
BDBM50341136
(CHEMBL1760548 | N-p-Methoxy cinnamoyl serotonin)
Show SMILES COc1ccc(\C=C\C(=O)NCCc2c[nH]c3ccc(O)cc23)cc1
Show InChI InChI=1S/C20H20N2O3/c1-25-17-6-2-14(3-7-17)4-9-20(24)21-11-10-15-13-22-19-8-5-16(23)12-18(15)19/h2-9,12-13,22-23H,10-11H2,1H3,(H,21,24)/b9-4+
n/an/a 2.38E+4n/an/an/an/an/an/a
Kinki University
Curated by ChEMBL
Assay Description
Inhibition of mushroom tyrosinase after 25 mins by spectrophotometry
Bioorg Med Chem Lett 21: 1983-6 (2011)
Article DOI: 10.1016/j.bmcl.2011.02.028
BindingDB Entry DOI: 10.7270/Q2T43TCF