null
SMILES: CCN(C(C)=O)c1ccc(OC)c2nc(NC(=O)N3CCC(CC3)c3cccc(c3)C(F)(F)F)sc12
InChI Key: InChIKey=MCOQRPPGECKENM-UHFFFAOYSA-N
Activity Spreadsheet -- Enzyme Inhibition Constant Data from BindingDB
Found 3 hits for monomerid = 50341187
Trg + Lig
Ki
nM
ΔG°
kcal/mole
IC50
nM
Kd
nM
EC50/IC50
nM
koff
s-1
kon
M-1s-1
pHTemp
°C
Adenosine receptor A1
(Homo sapiens (Human))
BDBM50341187
(CHEMBL1760900 | N-(7-(N-ethylacetamido)-4-methoxyb...)
Show SMILES CCN(C(C)=O)c1ccc(OC)c2nc(NC(=O)N3CCC(CC3)c3cccc(c3)C(F)(F)F)sc12
Show InChI InChI=1S/C25H27F3N4O3S/c1-4-32(15(2)33)19-8-9-20(35-3)21-22(19)36-23(29-21)30-24(34)31-12-10-16(11-13-31)17-6-5-7-18(14-17)25(26,27)28/h5-9,14,16H,4,10-13H2,1-3H3,(H,29,30,34)
Reactome pathway
5n/an/an/an/an/an/an/an/a
Roche Research Center
Curated by ChEMBL
Assay Description
Displacement of [3H]-DPCPX from human adenosine A1 receptor after 1 hr
Bioorg Med Chem Lett 21: 1933-6 (2011)
Article DOI: 10.1016/j.bmcl.2011.02.053
BindingDB Entry DOI: 10.7270/Q2959HWD
Adenosine receptor A2a
(Homo sapiens (Human))
BDBM50341187
(CHEMBL1760900 | N-(7-(N-ethylacetamido)-4-methoxyb...)
Show SMILES CCN(C(C)=O)c1ccc(OC)c2nc(NC(=O)N3CCC(CC3)c3cccc(c3)C(F)(F)F)sc12
Show InChI InChI=1S/C25H27F3N4O3S/c1-4-32(15(2)33)19-8-9-20(35-3)21-22(19)36-23(29-21)30-24(34)31-12-10-16(11-13-31)17-6-5-7-18(14-17)25(26,27)28/h5-9,14,16H,4,10-13H2,1-3H3,(H,29,30,34)
NCI pathway
Reactome pathway
240n/an/an/an/an/an/an/an/a
Roche Research Center
Curated by ChEMBL
Assay Description
Displacement of [3H]ZM241385 from human adenosine A2A receptor after 1 hr
Bioorg Med Chem Lett 21: 1933-6 (2011)
Article DOI: 10.1016/j.bmcl.2011.02.053
BindingDB Entry DOI: 10.7270/Q2959HWD
Adenosine receptor A2b
(Homo sapiens (Human))
BDBM50341187
(CHEMBL1760900 | N-(7-(N-ethylacetamido)-4-methoxyb...)
Show SMILES CCN(C(C)=O)c1ccc(OC)c2nc(NC(=O)N3CCC(CC3)c3cccc(c3)C(F)(F)F)sc12
Show InChI InChI=1S/C25H27F3N4O3S/c1-4-32(15(2)33)19-8-9-20(35-3)21-22(19)36-23(29-21)30-24(34)31-12-10-16(11-13-31)17-6-5-7-18(14-17)25(26,27)28/h5-9,14,16H,4,10-13H2,1-3H3,(H,29,30,34)
NCI pathway
Reactome pathway
n/an/a 18n/an/an/an/an/an/a
Roche Research Center
Curated by ChEMBL
Assay Description
Inhibition of human adenosine A2B receptor expressed in CHO cells assessed as decrease in cellular cAMP level after 20 to 25 mins
Bioorg Med Chem Lett 21: 1933-6 (2011)
Article DOI: 10.1016/j.bmcl.2011.02.053
BindingDB Entry DOI: 10.7270/Q2959HWD